N,N-(Dimethyl)thiobenzamide
- Formula: C9H11NS
- Molecular weight: 165.255
- IUPAC Standard InChIKey: OPXCUUJACRRYMC-UHFFFAOYSA-N
- CAS Registry Number: 15482-60-7
- Chemical structure:
View 3d structure (requires JavaScript / HTML 5) - Other names: Benzenecarbothioamide, N,N-dimethyl-; Benzamide, N,N-dimethylthio-

Gas phase thermochemistry data

Data compiled by: Hussein Y. Afeefy, Joel F. Liebman, and Stephen E. Stein
Quantity | Value | Units | Method | Reference | Comment |
---|---|---|---|---|---|
ΔfH°gas | 136.1 ± 2.8 | kJ/mol | Ccr | Ribeiro Da Silva, Souza, et al., 1989 |

Condensed phase thermochemistry data

Data compiled by: Hussein Y. Afeefy, Joel F. Liebman, and Stephen E. Stein
Quantity | Value | Units | Method | Reference | Comment |
---|---|---|---|---|---|
ΔfH°solid | 41.3 ± 1.9 | kJ/mol | Ccr | Ribeiro Da Silva, Souza, et al., 1989 | |
Quantity | Value | Units | Method | Reference | Comment |
ΔcH°solid | -5757.0 ± 1.4 | kJ/mol | Ccr | Ribeiro Da Silva, Souza, et al., 1989 |

Phase change data

Data compiled by: Hussein Y. Afeefy, Joel F. Liebman, and Stephen E. Stein
Quantity | Value | Units | Method | Reference | Comment |
---|---|---|---|---|---|
ΔvapH° | 74. ± 4. | kJ/mol | C | Beak, Lee, et al., 1978 | |
Quantity | Value | Units | Method | Reference | Comment |
ΔsubH° | 94.8 ± 2.0 | kJ/mol | C | Ribeiro Da Silva, Souza, et al., 1989 |

Reaction thermochemistry data

Data compiled by: Hussein Y. Afeefy, Joel F. Liebman, and Stephen E. Stein

Individual Reactions

N,N-(Dimethyl)thiobenzamide = Benzenecarboximidothioic acid, N-methyl-, methyl ester

By formula: C9H11NS = C9H11NS

Quantity Value Units Method Reference Comment
Δr26.1 ± 0.2kcal/molEqkBeak, Lee, et al., 1978liquid phase

References

Ribeiro Da Silva, Souza, et al., 1989
Ribeiro Da Silva, M.D.M.C.; Souza, P.; Pilcher, G.,
Enthalpies of combustion of thiobenzamide, N,N-dimethylthiobenzamide, and N,N-diethylthiobenzamide,
J. Chem. Thermodyn., 1989, 21, 173-178. [all data]
Beak, Lee, et al., 1978
Beak, P.; Lee, J.-K.; Zeigler, J.M.,
Equilibration studies: amide-imidate and thioamide-thioimidate functions,
J. Org. Chem., 1978, 43, 1536-1538. [all data]