tris(1,1,1-trifluoro-2,4-pentanedionato)gallium(III)

Phase change data

Data compiled by: William E. Acree, Jr., James S. Chickos

Enthalpy of vaporization

ΔvapH (kJ/mol) Temperature (K) Reference Comment
75.6 ± 0.5430.Igumenov, Chumachenko, et al., 1978Based on data from 401. - 459. K.

Enthalpy of sublimation

ΔsubH (kJ/mol) Temperature (K) Method Reference
75.0373. - 403.TGAFahlman and Barron, 2000
118.8 ± 1.7378. - 433.GSMatsubara and Kuwamoto, 1985
89.4 ± 6.7386. - 401.N/AIgumenov, Chumachenko, et al., 1978

References

Igumenov, Chumachenko, et al., 1978
Igumenov, I.K.; Chumachenko, Yu.V.; Zemskov, S.V., Saturated vapor pressure of aluminum, gallium, and indium tris(trifluoroacetylacetonates), Zh. Fiz. Khim., 1978, 52, 10, 2664. [all data]

Fahlman and Barron, 2000
Fahlman, Bradley D.; Barron, Andrew R., Substituent effects on the volatility of metal ?-diketonates, Adv. Mater. Opt. Electron., 2000, 10, 3-5, 223-232, https://doi.org/10.1002/1099-0712(200005/10)10:3/5<223::AID-AMO411>3.0.CO;2-M . [all data]

Matsubara and Kuwamoto, 1985
Matsubara, Norio; Kuwamoto, Tooru, Vapor pressures and enthalpies of sublimation and evaporation of trifluoroacetylacetonates in helium and helium containing the ligand vapor, Inorg. Chem., 1985, 24, 17, 2697-2701, https://doi.org/10.1021/ic00211a022 . [all data]