3-Dimethylamino-2,2-dimethylpropionaldehyde
- Formula: C7H15NO
- Molecular weight: 129.2001
- IUPAC Standard InChIKey: NYUOVICEZDPRBR-UHFFFAOYSA-N
- CAS Registry Number: 15451-14-6
- Chemical structure:
View 3d structure (requires JavaScript / HTML 5) - Other names: Propanal, 3-(dimethylamino)-2,2-dimethyl-

Phase change data

Data compiled by: Robert L. Brown and Stephen E. Stein
Quantity | Value | Units | Method | Reference | Comment |
---|---|---|---|---|---|
Tboil | 415. to 417. | K | N/A | Frinton Laboratories Inc., 1986 |

References

Frinton Laboratories Inc., 1986
Frinton Laboratories Inc.,
Catalog Number 11, Frinton Laboratories Inc., Vineland, NJ, 1986, 99. [all data]