1,2-Benzisothiazol-3(2H)-one, 2-methyl-, 1,1-dioxide
- Formula: C8H7NO3S
- Molecular weight: 197.211
- IUPAC Standard InChIKey: DDIIAJRLFATEEE-UHFFFAOYSA-N
- CAS Registry Number: 15448-99-4
- Chemical structure:
View 3d structure (requires JavaScript / HTML 5) - Other names: 1,2-Benzisothiazolin-3-one, 2-methyl-, 1,1-dioxide; N-Methylsaccharin; 2-Methyl-1,2-benzisothiazole-3(2H)-one-1,1-dioxide; 2-Methyl-1,2-benzisothiazol-3(2H)-one 1,1-dioxide; Saccharin methylated; NSC 39120; 2-Methyl-1,1-dioxo-1,2-dihydro-1lambda*6*-benzo[d]isothiazol-3-one; Saccharin methylated (major component)

Normal alkane RI, non-polar column, isothermal

Column type | Active phase | Temperature (C) | I | Reference | Comment |
---|---|---|---|---|---|
Packed | SE-52 | 150. | 1655. | Konig, 1971 | He, Chromosorb G (80-100 mesh); Column length: 2. m |

Normal alkane RI, non-polar column, temperature ramp

Column type | Active phase | I | Reference | Comment |
---|---|---|---|---|
Capillary | OV-101 | 1674. | Pinkston, Spiteller, et al., 1981 | H2, 80. C @ 7. min, 2. K/min; Column length: 30. m; Column diameter: 0.3 mm; Tend: 275. C |

References

Konig, 1971
Konig, H.,
Trenning, Nachweis and Bestimmung der kunstlichen Susstoffe Cyclamat, Dulcin and Saccharin mittels Gas-Chromatographie,
Z. Anal. Chem., 1971, 255, 2, 123-125, https://doi.org/10.1007/BF00424446
. [all data]
Pinkston, Spiteller, et al., 1981
Pinkston, D.; Spiteller, G.; von Henning, H.; Matthaei, D.,
High-resolution gas chromatography-mass spectrometry of the methyl esters of organic acids from uremic hemofiltrates,
J. Chromatogr., 1981, 223, 1, 1-19, https://doi.org/10.1016/S0378-4347(00)80063-8
. [all data]