Octahydro-1,2,4-metheno-3H-cyclobuta [cd] pentalen-3-one
- Formula: C10H10O
- Molecular weight: 146.1858
- IUPAC Standard InChIKey: KIOXQCAVQTVNCR-UHFFFAOYSA-N
- CAS Registry Number: 15443-37-5
- Chemical structure:
View 3d structure (requires JavaScript / HTML 5) - Permanent link for this species. Use this link for bookmarking this species for future reference.

Condensed phase thermochemistry data

Data compiled by: Hussein Y. Afeefy, Joel F. Liebman, and Stephen E. Stein
Quantity | Value | Units | Method | Reference | Comment |
---|---|---|---|---|---|
ΔfH°solid | 12.60 | kcal/mol | Ccb | Cookson, Crundwell, et al., 1964 | |
Quantity | Value | Units | Method | Reference | Comment |
ΔcH°solid | -1294.70 | kcal/mol | Ccb | Cookson, Crundwell, et al., 1964 | Corresponding ΔfHºsolid = 12.61 kcal/mol (simple calculation by NIST; no Washburn corrections) |

References

Cookson, Crundwell, et al., 1964
Cookson, R.C.; Crundwell, E.; Hill, R.R.; Hudec, J.,
586. Photochemical cyclisation of Diels-Alder adducts.,
J. Chem. Soc., 1964, 3062-3075. [all data]