Decanedioic acid, dipropyl ester
- Formula: C16H30O4
- Molecular weight: 286.4070
- IUPAC Standard InChIKey: UHGPEWTZABDZCE-UHFFFAOYSA-N
- CAS Registry Number: 15419-91-7
- Chemical structure:
View 3d structure (requires JavaScript / HTML 5) - Other names: dipropyl sebacate; dipropyl decanedioate

Kovats' RI, non-polar column, isothermal

Column type | Active phase | Temperature (C) | I | Reference | Comment |
---|---|---|---|---|---|
Packed | SE-30 | 220. | 1957. | Zulaïca and Guiochon, 1963 | Column length: 2. m |

References

Zulaïca and Guiochon, 1963
Zulaïca, J.; Guiochon, G.,
Séparation et identification de di-esters aliphatiques et aromatiques et de trimesters phosphoriques par chromatographie en phase gazeuse,
Bull. Soc. Chim. Fr., 1963, 6, 1242-1252. [all data]