Bi-2-cyclohexen-1-yl
- Formula: C12H18
- Molecular weight: 162.2713
- IUPAC Standard InChIKey: HFROTUORNFZKSE-UHFFFAOYSA-N
- CAS Registry Number: 1541-20-4
- Chemical structure:
View 3d structure (requires JavaScript / HTML 5) - Other names: 3,3'-Bicyclohexenyl

Reaction thermochemistry data

Data compiled by: Hussein Y. Afeefy, Joel F. Liebman, and Stephen E. Stein
Individual Reactions
By formula: 2H2 + C12H18 = C12H22
Quantity | Value | Units | Method | Reference | Comment |
---|---|---|---|---|---|
ΔrH° | -57.4 ± 0.2 | kcal/mol | Chyd | Roth, Adamczak, et al., 1991 | liquid phase |

References

Roth, Adamczak, et al., 1991
Roth, W.R.; Adamczak, O.; Breuckmann, R.; Lennartz, H.-W.; Boese, R.,
Die Berechnung von Resonanzenergien; das MM2ERW-Kraftfeld,
Chem. Ber., 1991, 124, 2499-2521. [all data]