1,8-Cyclotetradecadiyne
- Formula: C14H20
- Molecular weight: 188.3086
- IUPAC Standard InChIKey: BVTCHBNCNJEJTD-UHFFFAOYSA-N
- CAS Registry Number: 1540-80-3
- Chemical structure:
View 3d structure (requires JavaScript / HTML 5) - Permanent link for this species. Use this link for bookmarking this species for future reference.

Gas phase thermochemistry data

Data compiled by: Hussein Y. Afeefy, Joel F. Liebman, and Stephen E. Stein
Quantity | Value | Units | Method | Reference | Comment |
---|---|---|---|---|---|
ΔfH°gas | 313.8 ± 4.0 | kJ/mol | Ccb | Frisch, Bautista, et al., 1964 | see Frisch, 1962 |

Condensed phase thermochemistry data

Data compiled by: Hussein Y. Afeefy, Joel F. Liebman, and Stephen E. Stein
Quantity | Value | Units | Method | Reference | Comment |
---|---|---|---|---|---|
ΔfH°solid | 147.7 ± 2.3 | kJ/mol | Ccb | Frisch, Bautista, et al., 1964 | see Frisch, 1962 |
Quantity | Value | Units | Method | Reference | Comment |
ΔcH°solid | -8515.2 ± 1.7 | kJ/mol | Ccb | Frisch, Bautista, et al., 1964 | see Frisch, 1962; Corresponding ΔfHºsolid = 147.7 kJ/mol (simple calculation by NIST; no Washburn corrections) |

Phase change data

Data compiled as indicated in comments:
TRC - Thermodynamics Research Center, NIST Boulder Laboratories, Chris Muzny director
AC - William E. Acree, Jr., James S. Chickos
DRB - Donald R. Burgess, Jr.
ALS - Hussein Y. Afeefy, Joel F. Liebman, and Stephen E. Stein
Quantity | Value | Units | Method | Reference | Comment |
---|---|---|---|---|---|
Tfus | 370. | K | N/A | Chickos, Hesse, et al., 1990 | Uncertainty assigned by TRC = 0.3 K; TRC |
Quantity | Value | Units | Method | Reference | Comment |
ΔsubH° | 94.3 | kJ/mol | CGC-DSC | Chickos, Hesse, et al., 1998 | AC |
ΔsubH° | 166.1 | kJ/mol | N/A | Frisch, Bautista, et al., 1964 | DRB |
Antoine Equation Parameters
log10(P) = A − (B / (T + C))
P = vapor pressure (bar)
T = temperature (K)
View plot Requires a JavaScript / HTML 5 canvas capable browser.
Temperature (K) | A | B | C | Reference | Comment |
---|---|---|---|---|---|
317.09 to 332.39 | 3.85915 | 686.983 | -233.124 | Frisch, Bautista, et al., 1964 | Coefficents calculated by NIST from author's data. |
Enthalpy of sublimation
ΔsubH (kJ/mol) | Temperature (K) | Method | Reference | Comment |
---|---|---|---|---|
87.6 ± 1.0 | 338. | HSA | Chickos, Hesse, et al., 1998 | Based on data from 315. to 364. K.; AC |
166.0 ± 3.2 | 355. | V | Frisch, Bautista, et al., 1964 | see Frisch, 1962; ALS |
166.0 ± 3.2 | 325. | ME | Frisch, Bautista, et al., 1964 | Based on data from 317. to 332. K. See also Cox and Pilcher, 1970.; AC |
Enthalpy of fusion
ΔfusH (kJ/mol) | Temperature (K) | Reference | Comment |
---|---|---|---|
22.6 | 370. | Augdahl, Borgen, et al., 1974 | AC |

Reaction thermochemistry data

Data compiled by: Hussein Y. Afeefy, Joel F. Liebman, and Stephen E. Stein
Individual Reactions
By formula: 4H2 + C14H20 = C14H28
Quantity | Value | Units | Method | Reference | Comment |
---|---|---|---|---|---|
ΔrH° | -524.7 ± 0.59 | kJ/mol | Chyd | Turner, Jarrett, et al., 1973 | liquid phase; solvent: Acetic acid |

References

Frisch, Bautista, et al., 1964
Frisch, M.A.; Bautista, R.G.; Margrave, J.L.; Parsons, C.G.; Wotiz, J.H.,
Strain energies in hydrocarbons from heats of combustion. II. Concerning the possibility of a transannular interaction in 1,8-cyclotetradecadiyne,
J. Am. Chem. Soc., 1964, 86, 335-336. [all data]
Frisch, 1962
Frisch, M.A.,
A high precision calorimeter for ther measurement of small energy differences, Ph.D. Thesis for University of Wisconsin, 1962, 1-100. [all data]
Chickos, Hesse, et al., 1990
Chickos, J.S.; Hesse, D.G.; Liebman, J.F.,
Estimating entropies and enthalpies of fusion of hydrocarbons,
J. Org. Chem., 1990, 55, 3833-40. [all data]
Chickos, Hesse, et al., 1998
Chickos, James; Hesse, Donald; Hosseini, Sarah; Nichols, Gary; Webb, Paul,
Sublimation enthalpies at 298.15K using correlation gas chromatography and differential scanning calorimetry measurements,
Thermochimica Acta, 1998, 313, 2, 101-110, https://doi.org/10.1016/S0040-6031(97)00432-2
. [all data]
Cox and Pilcher, 1970
Cox, J.D.; Pilcher, G.,
Thermochemistry of Organic and Organometallic Compounds, Academic Press Inc., London, 1970, 643. [all data]
Augdahl, Borgen, et al., 1974
Augdahl, Else; Borgen, Gerd; Dale, Johannes; Krane, Jostein; Taticchi, A.; Mannervik, Bengt,
The Conformations of Cyclotetradeca-1,8-diyne.,
Acta Chem. Scand., 1974, 28b, 125-129, https://doi.org/10.3891/acta.chem.scand.28b-0125
. [all data]
Turner, Jarrett, et al., 1973
Turner, R.B.; Jarrett, A.D.; Goebel, P.; Mallon, B.J.,
Heats of hydrogenation. 9. Cyclic acetylenes and some miscellaneous olefins,
J. Am. Chem. Soc., 1973, 95, 790-792. [all data]