Ethane, 1-chloro-1-methoxy-
- Formula: C3H7ClO
- Molecular weight: 94.540
- CAS Registry Number: 1538-87-0

Gas phase thermochemistry data

Data compiled by: Hussein Y. Afeefy, Joel F. Liebman, and Stephen E. Stein
Quantity | Value | Units | Method | Reference | Comment |
---|---|---|---|---|---|
ΔfH°gas | -273. ± 5.0 | kJ/mol | Eqk | Cruickshank and Benson, 1969 |

Reaction thermochemistry data

Data compiled by: Hussein Y. Afeefy, Joel F. Liebman, and Stephen E. Stein
Individual Reactions
By formula: C3H7ClO = C3H6O + HCl
Quantity | Value | Units | Method | Reference | Comment |
---|---|---|---|---|---|
ΔrH° | 71.1 | kJ/mol | Eqk | Cruickshank and Benson, 1969 | gas phase |

Normal alkane RI, non-polar column, temperature ramp

Column type | Active phase | I | Reference | Comment |
---|---|---|---|---|
Capillary | OV-101 | 598. | Zenkevich, Eliseenkov, et al., 2011 | 25. m/0.20 mm/0.25 μm, Nitrogen, 6. K/min; Tstart: 40. C; Tend: 220. C |

References

Cruickshank and Benson, 1969
Cruickshank, F.R.; Benson, S.W.,
Some thermochemical properties of methyl vinyl ether, α-chloroethyl methyl ether, and iodomethyl methyl ether. Evidence for nonbonded electrostatic interactions,
J. Am. Chem. Soc., 1969, 91, 2487-2490. [all data]
Zenkevich, Eliseenkov, et al., 2011
Zenkevich, I.G.; Eliseenkov, E.V.; Kasatochkin, A.N.; Ukolov, A.I.,
Identification of the products of nonregioselective organic reactions by chromatography - mass spectrometry: chloro derivatives of dialkyl ethers,
Rus. J. Anal. Chem., 2011, 66, 14, 1445-1454, https://doi.org/10.1134/S1061934811140218
. [all data]