2,2-Dimethylpropanoic anhydride
- Formula: C10H18O3
- Molecular weight: 186.2481
- IUPAC Standard InChIKey: PGZVFRAEAAXREB-UHFFFAOYSA-N
- CAS Registry Number: 1538-75-6
- Chemical structure:
View 3d structure (requires JavaScript / HTML 5) - Other names: Trimethylacetic anhydride; Pivalic anhydride; Pivalic anydride; Propanoic acid, 2,2-dimethyl-, anhydride; Pivaloyl anhydride

Phase change data

Data compiled as indicated in comments:
BS - Robert L. Brown and Stephen E. Stein
AC - William E. Acree, Jr., James S. Chickos
Quantity | Value | Units | Method | Reference | Comment |
---|---|---|---|---|---|
Tboil | 466.2 | K | N/A | Aldrich Chemical Company Inc., 1990 | BS |
Enthalpy of vaporization
ΔvapH (kJ/mol) | Temperature (K) | Method | Reference | Comment |
---|---|---|---|---|
50.7 ± 0.2 | 360. | EB | Steele, Chirico, et al., 2002 | Based on data from 355. to 513. K.; AC |
47.4 ± 0.2 | 400. | EB | Steele, Chirico, et al., 2002 | Based on data from 355. to 513. K.; AC |
44.0 ± 0.4 | 440. | EB | Steele, Chirico, et al., 2002 | Based on data from 355. to 513. K.; AC |
40.3 ± 0.7 | 480. | EB | Steele, Chirico, et al., 2002 | Based on data from 355. to 513. K.; AC |

Reaction thermochemistry data

Data compiled by: Hussein Y. Afeefy, Joel F. Liebman, and Stephen E. Stein
Individual Reactions
By formula: C10H18O3 + H2O = 2C5H10O2
Quantity | Value | Units | Method | Reference | Comment |
---|---|---|---|---|---|
ΔrH° | -63.26 | kJ/mol | Cm | Conn, Kistiakowsky, et al., 1942 | liquid phase; Heat of hydrolysis at 303 K |

Normal alkane RI, non-polar column, custom temperature program

Column type | Active phase | I | Reference | Comment |
---|---|---|---|---|
Capillary | Polydimethyl siloxanes | 1053. | Zenkevich, 2001 | Program: not specified |

References

Aldrich Chemical Company Inc., 1990
Aldrich Chemical Company Inc.,
Catalog Handbook of Fine Chemicals, Aldrich Chemical Company, Inc., Milwaukee WI, 1990, 1. [all data]
Steele, Chirico, et al., 2002
Steele, W.V.; Chirico, R.D.; Cowell, A.B.; Knipmeyer, S.E.; Nguyen, A.,
Thermodynamic Properties and Ideal-Gas Enthalpies of Formation for trans -Methyl Cinnamate, α-Methyl Cinnamaldehyde, Methyl Methacrylate, 1-Nonyne, Trimethylacetic Acid, Trimethylacetic Anhydride, and Ethyl Trimethyl Acetate,
J. Chem. Eng. Data, 2002, 47, 4, 700-714, https://doi.org/10.1021/je010086r
. [all data]
Conn, Kistiakowsky, et al., 1942
Conn, J.B.; Kistiakowsky, G.B.; Roberts, R.M.; Smith, E.A.,
Heats of organic reactions. XIII. Heats of hydrolysis of some acid anhydrides,
J. Am. Chem. Soc., 1942, 64, 1747-17. [all data]
Zenkevich, 2001
Zenkevich, I.G.,
Encyclopedia of Chromatography. Derivatization of Amines, Amino Acids, Amides and Imides for GC Analysis, Marcel Dekker, Inc, New York - Basel, 2001, 224. [all data]