Carbamic acid, phenyl-, butyl ester
- Formula: C11H15NO2
- Molecular weight: 193.2423
- IUPAC Standard InChIKey: ZTIMKJROOYMUMU-UHFFFAOYSA-N
- CAS Registry Number: 1538-74-5
- Chemical structure:
View 3d structure (requires JavaScript / HTML 5) - Other names: Carbanilic acid, butyl ester; Butyl carbanilate; Butyl N-phenylcarbamate; Butyl N-phenylurethane; Butylphenylurethane; Carbanilic acid, n-butyl ester; Phenylcarbamic acid butyl ester

Condensed phase thermochemistry data

Data compiled by: Hussein Y. Afeefy, Joel F. Liebman, and Stephen E. Stein
Quantity | Value | Units | Method | Reference | Comment |
---|---|---|---|---|---|
ΔcH°solid | -6077. ± 3. | kJ/mol | Ccb | Zhuravlev, Serukhina, et al., 1965 |

Reaction thermochemistry data

Data compiled by: Hussein Y. Afeefy, Joel F. Liebman, and Stephen E. Stein
Individual Reactions
By formula: C7H5NO + C4H10O = C11H15NO2
Quantity | Value | Units | Method | Reference | Comment |
---|---|---|---|---|---|
ΔrH° | -83.9 ± 4.4 | kJ/mol | Cm | Pannone and Macosko, 1987 | liquid phase |
ΔrH° | -105. ± 1. | kJ/mol | Cm | Lovering and Laidler, 1962 | solid phase |

Kovats' RI, non-polar column, isothermal

View large format table.

Column type Active phase Temperature (C) I Reference Comment
PackedSE-30140.1591.Gerqasimenko and Voskoboinikov, 1987Column length: 1. m
PackedSE-30140.1593.Gerqasimenko and Voskoboinikov, 1987Column length: 1. m
PackedSE-30160.1593.Gerqasimenko and Voskoboinikov, 1987Column length: 1. m
PackedSE-30160.1591.Gudovicheva and Boitsov, 1985Column length: 100. m

Kovats' RI, polar column, isothermal

View large format table.

Column type Active phase Temperature (C) I Reference Comment
PackedPEG 4000160.2172.Gudovicheva and Boitsov, 1985N2, Inerton AW (0.16-0.20 mm); Column length: 1. m

Normal alkane RI, non-polar column, isothermal

View large format table.

Column type Active phase Temperature (C) I Reference Comment
PackedSE-30164.1579.Singlair, Macho, et al., 1989Nitrogen, Chromaton N AW DMCS; Column length: 2.5 m
PackedSE-30182.1603.Singlair, Macho, et al., 1989Nitrogen, Chromaton N AW DMCS; Column length: 2.5 m
PackedSE-30200.1619.Singlair, Macho, et al., 1989Nitrogen, Chromaton N AW DMCS; Column length: 2.5 m

References

Zhuravlev, Serukhina, et al., 1965
Zhuravlev, E.Z.; Serukhina, S.Ya.; Konstantinov, I.I.,
Heats of combustion of certain phenylcarbamate esters (carbanilates),
J. Appl. Chem. USSR (Engl. Transl.), 1965, 38, 2775-2776. [all data]
Pannone and Macosko, 1987
Pannone, M.C.; Macosko, C.W.,
Kinetics of isocyanate amine reactions,
J. Appl. Polym. Sci., 1987, 34, 2409-2432. [all data]
Lovering and Laidler, 1962
Lovering, E.G.; Laidler, K.J.,
Thermochemical studies of some alcohol-isocyanate reactions,
Can. J. Chem., 1962, 40, 26-30. [all data]