(Ethylamino) bis(trifluoromethyl)arsine

Phase change data

Data compiled by: William E. Acree, Jr., James S. Chickos

Enthalpy of vaporization

ΔvapH (kJ/mol) Temperature (K) Reference Comment
32.8330.Cullen and Emel«65533»us, 1959Based on data from 292. - 368. K.

References

Cullen and Emel«65533»us, 1959
Cullen, W.R.; Emel«65533»us, H.J., 66. Ammonolysis and aminolysis of trifluoromethyl arsenicals, J. Chem. Soc., 1959, 372, https://doi.org/10.1039/jr9590000372 . [all data]