Cyclohexanol, 5-methyl-2-(1-methylethyl)-, (1α,2β,5α)-
- Formula: C10H20O
- Molecular weight: 156.2652
- IUPAC Standard InChIKey: NOOLISFMXDJSKH-KXUCPTDWSA-N
- CAS Registry Number: 15356-70-4
- Chemical structure:
View 3d structure (requires JavaScript / HTML 5) - Species with the same structure:
- Stereoisomers:
- Cyclohexanol, 5-methyl-2-(1-methylethyl)-
- Cyclohexanol, 5-methyl-2-(1-methylethyl)-, [1R-(1α,2α,5β)]-
- Levomenthol
- Cyclohexanol, 5-methyl-2-(1-methylethyl)-, [1S-(1α,2α,5β)]-
- Cyclohexanol, 5-methyl-2-(1-methylethyl)-, [1S-(1α,2β,5β)]-
- Cyclohexanol, 5-methyl-2-(1-methylethyl)-, (1α,2β,5β)-
- Cyclohexanol, 5-methyl-2-(1-methylethyl)-, (1α,2α,5β)-
- Cyclohexanol, 5-methyl-2-(1-methylethyl)-, (1α,2α,5α)-
- Other names: Menthol, cis-1,3,trans-1,4-; Hexahydrothymol; Menthacamphor; Menthol; Menthomenthol; Peppermint camphor; dl-Menthol; p-Menthan-3-ol; Cyclohexanol, 2-isopropyl-5-methyl-; NCI-C50000; 5-Methyl-2-(1-methylethyl)cyclohexanol; 2-Isopropyl-5-methylcyclohexanol; l-Menthol; 3-p-Menthanol; 5α-Methyl-2β-(1α-methylethyl)cyclohexanol; component of Dermoplast; Fancol menthol; Fisherman's friend lozenges; Menthol terpine hydrate; component of Minut-rub; Racemic menthol; component of Robitussin cough drops; component of Sarna; component of Theragesic; Therapeutic mineral ice; Cyclohexanol, 2-isopropyl-5-methyl-, (1α,2β,5α)-; 2-Isopropyl-5-methylcyclohexanol, (1α,2β,5α)-; 5-Methyl-2-(1-methylethyl)cyclohexanol, (1α,2β,5α)-; (.+/-.)-Menthol; Cyclohexanol, 5-methyl-2-(1-methylethyl)-, (1R,2S,5R)-rel-; NSC 2603; Racementhol; rac-Menthol; Diterpene; Cyclohexanol, 5-methyl-2-(1-methylethyl)-, (1α,2β,5α)-(.+/-.)-

Phase change data

Data compiled by: Robert L. Brown and Stephen E. Stein
Reduced pressure boiling point
Tboil (K) | Pressure (bar) | Reference |
---|---|---|
376.7 | 0.01 | Aldrich Chemical Company Inc., 1990 |

References

Aldrich Chemical Company Inc., 1990
Aldrich Chemical Company Inc.,
Catalog Handbook of Fine Chemicals, Aldrich Chemical Company, Inc., Milwaukee WI, 1990, 1. [all data]