9,9'-Bi-9H-fluorene
- Formula: C26H18
- Molecular weight: 330.4211
- IUPAC Standard InChIKey: QXAIDADUIMVTPS-UHFFFAOYSA-N
- CAS Registry Number: 1530-12-7
- Chemical structure:
View 3d structure (requires JavaScript / HTML 5) - Other names: 9,9'-Bifluorene; Bifluorenyl; 9,9'-Bifluorenyl; Bisfluorenyl

Phase change data

Data compiled as indicated in comments:
TRC - Thermodynamics Research Center, NIST Boulder Laboratories, Chris Muzny director
AC - William E. Acree, Jr., James S. Chickos
DRB - Donald R. Burgess, Jr.
ALS - Hussein Y. Afeefy, Joel F. Liebman, and Stephen E. Stein
Quantity | Value | Units | Method | Reference | Comment |
---|---|---|---|---|---|
Tfus | 518.35 | K | N/A | Schuyer, Blom, et al., 1953 | Uncertainty assigned by TRC = 1. K; TRC |
Quantity | Value | Units | Method | Reference | Comment |
ΔsubH° | 132.6 ± 2.3 | kJ/mol | Review | Roux, Temprado, et al., 2008 | There are sufficient literature values to make a qualified recommendation where the suggested value is in good agreement with values predicted using thermochemical cycles or from reliable estimates. In general, the evaluated uncertainty limits are on the order of (2 to 4) kJ/mol.; DRB |
ΔsubH° | 132.61 | kJ/mol | V | Rakus, Verevkin, et al., 1994 | crystal phase; ALS |
ΔsubH° | 132.6 | kJ/mol | N/A | Rakus, Verevkin, et al., 1994 | DRB |
ΔsubH° | 132.6 ± 1.1 | kJ/mol | N/A | Rakus, Verevkin, et al., 1994 | AC |
Enthalpy of vaporization
ΔvapH (kJ/mol) | Temperature (K) | Method | Reference | Comment |
---|---|---|---|---|
95.7 | 383. to 408. | B | Rakus, Verevkin, et al., 1994 | AC |
Enthalpy of sublimation
ΔsubH (kJ/mol) | Temperature (K) | Method | Reference | Comment |
---|---|---|---|---|
131.8 ± 1.1 | 395. | T | Rakus, Verevkin, et al., 1994 | Based on data from 383. to 408. K.; AC |
Enthalpy of fusion
ΔfusH (kJ/mol) | Temperature (K) | Reference | Comment |
---|---|---|---|
36.9 | 519.2 | Rakus, Verevkin, et al., 1994 | AC |

Gas phase thermochemistry data

Data compiled as indicated in comments:
DRB - Donald R. Burgess, Jr.
ALS - Hussein Y. Afeefy, Joel F. Liebman, and Stephen E. Stein

Quantity Value Units Method Reference Comment
Δfgas78.9 ± 1.0kcal/molReviewRoux, Temprado, et al., 2008There are insufficient literature values to properly evaluate the data and insufficient information to construct thermochemical cycles or estimate values for comparison, and one must rely solely upon reported uncertainities and the quality of the measurements. In general, the evaluated uncertainty limits are on the order of (3 to 9) kJ/mol.; DRB
Δfgas78.89 ± 0.54kcal/molCcrRakus, Verevkin, et al., 1994ALS

Condensed phase thermochemistry data

Data compiled as indicated in comments:
DRB - Donald R. Burgess, Jr.
ALS - Hussein Y. Afeefy, Joel F. Liebman, and Stephen E. Stein

Quantity Value Units Method Reference Comment
Δfsolid47.20 ± 0.84kcal/molReviewRoux, Temprado, et al., 2008There are insufficient literature values to properly evaluate the data and insufficient information to construct thermochemical cycles or estimate values for comparison, and one must rely solely upon reported uncertainities and the quality of the measurements. In general, the evaluated uncertainty limits are on the order of (3 to 9) kJ/mol.; DRB
Δfsolid47.20 ± 0.46kcal/molCcrRakus, Verevkin, et al., 1994crystal phase; ALS
Quantity Value Units Method Reference Comment
Δcsolid-3107.50 ± 0.18kcal/molCcrRakus, Verevkin, et al., 1994crystal phase; Corresponding Δfsolid = 47.337 kcal/mol (simple calculation by NIST; no Washburn corrections); ALS

References

Schuyer, Blom, et al., 1953
Schuyer, J.; Blom, L.; Van Krevelen, D.W.,
Molar refraction of condensed aromatic compounds.,
Trans. Faraday Soc., 1953, 49, 1391. [all data]
Roux, Temprado, et al., 2008
Roux, M.V.; Temprado, M.; Chickos, J.S.; Nagano, Y.,
Critically Evaluated Thermochemical Properties of Polycyclic Aromatic Hydrocarbons,
J. Phys. Chem. Ref. Data, 2008, 37, 4, 1855-1996. [all data]
Rakus, Verevkin, et al., 1994
Rakus, K.; Verevkin, S.P.; Schatzer, J.; Beckhaus, H.-D.; Ruchardt, C.,
Thermochemistry and thermal decomposition of 9,9'-bifluorenyl and 9,9'-dimethyl-9,9'-bifluorenyl - the stabilization energy of 9-fluorenyl radicals,
Chem. Ber., 1994, 127, 1095-1103. [all data]