Heptane, 1,1-diphenyl-
- Formula: C19H24
- Molecular weight: 252.3939
- IUPAC Standard InChIKey: MZLKNWMNBXHXMA-UHFFFAOYSA-N
- CAS Registry Number: 1530-05-8
- Chemical structure:
View 3d structure (requires JavaScript / HTML 5) - Other names: 1,1-Diphenylheptane; Benzene, 1,1'-heptylidenebis-

Phase change data

Data compiled by: Thermodynamics Research Center, NIST Boulder Laboratories, Chris Muzny director
Quantity | Value | Units | Method | Reference | Comment |
---|---|---|---|---|---|
Tboil | 506. | K | N/A | Auger, 1887 | Uncertainty assigned by TRC = 4. K |
Quantity | Value | Units | Method | Reference | Comment |
Tfus | 286.05 | K | N/A | Anonymous, 1968 | Uncertainty assigned by TRC = 0.5 K |
Tfus | 286.1 | K | N/A | Schiessler, 1947 | Uncertainty assigned by TRC = 1. K |
Tfus | 287. | K | N/A | Klages and Heilmann, 1904 | Uncertainty assigned by TRC = 4. K |
Tfus | 287. | K | N/A | Krafft, 1886 | Uncertainty assigned by TRC = 2. K |

References

Auger, 1887
Auger, V.,
Bull. Soc. Chim. Fr., 1887, 47, 42. [all data]
Anonymous, 1968
Anonymous, R.,
Properties of hydrocarbon of high molecular weight, Am. Pet. Inst. Res. Proj. 42, Penn. State Univ., 1968. [all data]
Schiessler, 1947
Schiessler, R.W.,
, Am. Pet. Inst. Res. Proj. 42, Twelfth Meeting, 1947. [all data]
Klages and Heilmann, 1904
Klages, A.; Heilmann, S.,
Chem. Ber., 1904, 37, 1447. [all data]
Krafft, 1886
Krafft, F.,
Several high molecular benzene derivative.,
Ber. Dtsch. Chem. Ges., 1886, 19, 2982. [all data]