Benzene, 1,1'-propylidenebis-
- Formula: C15H16
- Molecular weight: 196.2875
- IUPAC Standard InChIKey: BUZMJVBOGDBMGI-UHFFFAOYSA-N
- CAS Registry Number: 1530-03-6
- Chemical structure:
View 3d structure (requires JavaScript / HTML 5) - Other names: 1,1-Diphenylpropane

Phase change data

Data compiled as indicated in comments:
TRC - Thermodynamics Research Center, NIST Boulder Laboratories, Chris Muzny director
AC - William E. Acree, Jr., James S. Chickos
Quantity | Value | Units | Method | Reference | Comment |
---|---|---|---|---|---|
Tboil | 552. ± 6. | K | AVG | N/A | Average of 7 values; Individual data points |
Quantity | Value | Units | Method | Reference | Comment |
Tfus | 286.44 | K | N/A | Serijan and Wise, 1951 | Uncertainty assigned by TRC = 0.2 K; TRC |
Tfus | 286.44 | K | N/A | Wise, Serijan, et al., 1950 | Uncertainty assigned by TRC = 0.5 K; TRC |
Tfus | 267.0 | K | N/A | Wooster and Ryan, 1939 | Uncertainty assigned by TRC = 3. K; TRC |
Quantity | Value | Units | Method | Reference | Comment |
ΔvapH° | 72.8 ± 0.4 | kJ/mol | GS | Verevkin, 1999 | Based on data from 298. to 343. K.; AC |
Enthalpy of vaporization
ΔvapH (kJ/mol) | Temperature (K) | Method | Reference | Comment |
---|---|---|---|---|
71.4 ± 0.4 | 321. | GS | Verevkin, 1999 | Based on data from 298. to 343. K.; AC |

Condensed phase thermochemistry data

Data compiled by: Hussein Y. Afeefy, Joel F. Liebman, and Stephen E. Stein
Quantity | Value | Units | Method | Reference | Comment |
---|---|---|---|---|---|
ΔcH°liquid | -7887. | kJ/mol | Ccb | Serijan and Wise, 1951 | Corresponding ΔfHºliquid = -300. kJ/mol (simple calculation by NIST; no Washburn corrections) |
ΔcH°liquid | -8245.0 | kJ/mol | Ccb | Wise, Serijan, et al., 1951 | Corresponding ΔfHºliquid = 55.6 kJ/mol (simple calculation by NIST; no Washburn corrections) |

References

Serijan and Wise, 1951
Serijan, K.T.; Wise, P.H.,
Dicylic Hydrocarbons. III. Diphenyl- and Dicyclohexylalkanes through C15,
J. Am. Chem. Soc., 1951, 73, 4766. [all data]
Wise, Serijan, et al., 1950
Wise, P.H.; Serijan, K.T.; Goodman, I.A.,
Correlation of Physical Properties with Molecular Structre for Dicyclic Hydrocarbons. I. 2-n-Alakylbiphenyl-1,1-alkane, α,ω-dicyclohexylalkane Series, Nat. Advis. Comm. Aeronaut., Tech. Notes, No. 2081, Lewis Flight Propulsion Lab., Cleveland, OH, 1950. [all data]
Wooster and Ryan, 1939
Wooster, C.B.; Ryan, J.F.,
The Reduction of Phenylated Olefins with Alkali Metals in Liquid Ammonia Solution,
J. Am. Chem. Soc., 1939, 56, 1133-6. [all data]
Verevkin, 1999
Verevkin, Sergey P.,
Thermochemical Properties of Diphenylalkanes,
J. Chem. Eng. Data, 1999, 44, 2, 175-179, https://doi.org/10.1021/je980200e
. [all data]