1,1'-Biphenyl, 4,4'-dinitro-
- Formula: C12H8N2O4
- Molecular weight: 244.2029
- IUPAC Standard InChIKey: BDLNCFCZHNKBGI-UHFFFAOYSA-N
- CAS Registry Number: 1528-74-1
- Chemical structure:
View 3d structure (requires JavaScript / HTML 5) - Other names: Biphenyl, 4,4'-dinitro-; 4,4'-Dinitrobiphenyl; 4,4'-Dinitrodiphenyl; 4,4'-Dinitrobifenyl

Phase change data

Data compiled by: William E. Acree, Jr., James S. Chickos
Enthalpy of sublimation
ΔsubH (kJ/mol) | Temperature (K) | Method | Reference | Comment |
---|---|---|---|---|
104.6 ± 1.8 | 420. | ME | Seki and Suzuki, 1953 | Based on data from 441. to 428. K. See also Jones, 1960. |

References

Seki and Suzuki, 1953
Seki, Syûzô; Suzuki, Keisuke,
Physico-Chemical Studies on Molecular Compounds. III. Vapor Pressures of Diphenyl, 4, 4'-Dinitrodiphenyl, and Molecular Compound between Them,
Bull. Chem. Soc. Jpn., 1953, 26, 5, 209-213, https://doi.org/10.1246/bcsj.26.209
. [all data]
Jones, 1960
Jones, A.H.,
Sublimation Pressure Data for Organic Compounds.,
J. Chem. Eng. Data, 1960, 5, 2, 196-200, https://doi.org/10.1021/je60006a019
. [all data]
Dorr and Gazis, 1966
Dorr, F.; Gazis, E.,
UV atlas of organic compounds, 1966, 1, D10/6. [all data]