CAS Reg. No. 152748-52-2
- CAS Registry Number: 152748-52-2

Reaction thermochemistry data

Data compiled by: John E. Bartmess
Individual Reactions
+ CAS Reg. No. 152748-52-2 = Cl2FSi-
By formula: Cl- + CAS Reg. No. 152748-52-2 = Cl2FSi-
Quantity | Value | Units | Method | Reference | Comment |
---|---|---|---|---|---|
ΔrH° | 205. ± 8.4 | kJ/mol | CIDT | Poutsma, Schroeder, et al., 2004 | gas phase |

Ion clustering data

Data compiled by: John E. Bartmess
Clustering reactions
+ CAS Reg. No. 152748-52-2 = Cl2FSi-
By formula: Cl- + CAS Reg. No. 152748-52-2 = Cl2FSi-
Quantity | Value | Units | Method | Reference | Comment |
---|---|---|---|---|---|
ΔrH° | 205. ± 8.4 | kJ/mol | CIDT | Poutsma, Schroeder, et al., 2004 | gas phase |

References

Poutsma, Schroeder, et al., 2004
Poutsma, J.C.; Schroeder, O.E.; Squires, R.R.,
Experimental chloride ion affinities and theoretical predictions for the absolute heats of formation of SiCl2 and SiClF,
Chem. Phys. Lett., 2004, 389, 4-6, 433-437, https://doi.org/10.1016/j.cplett.2004.03.137
. [all data]