cis-Dichlorobis(methylamine)platinum
- Formula: C2H10Cl2N2Pt
- Molecular weight: 328.104
- IUPAC Standard InChIKey: BIUKJHWDBXBHGQ-UHFFFAOYSA-L
- CAS Registry Number: 15273-32-2
- Chemical structure:
View 3d structure (requires JavaScript / HTML 5) - Permanent link for this species. Use this link for bookmarking this species for future reference.

Gas phase thermochemistry data

Data compiled by: José A. Martinho Simões
Quantity | Value | Units | Method | Reference | Comment |
---|---|---|---|---|---|
ΔfH°gas | -151. ± 20. | kJ/mol | Review | Martinho Simões |

Condensed phase thermochemistry data

Data compiled as indicated in comments:
MS - José A. Martinho Simões
DH - Eugene S. Domalski and Elizabeth D. Hearing
Quantity | Value | Units | Method | Reference | Comment |
---|---|---|---|---|---|
ΔfH°solid | -424.2 ± 8.3 | kJ/mol | Review | Martinho Simões | MS |
Quantity | Value | Units | Method | Reference | Comment |
S°solid,1 bar | 246.2 | J/mol*K | N/A | Palkin, Kuzina, et al., 1991 | DH |
Constant pressure heat capacity of solid
Cp,solid (J/mol*K) | Temperature (K) | Reference | Comment |
---|---|---|---|
192.50 | 298.15 | Palkin, Kuzina, et al., 1991 | T = 10 to 300 K.; DH |

Phase change data

Data compiled by: José A. Martinho Simões
Quantity | Value | Units | Method | Reference | Comment |
---|---|---|---|---|---|
ΔsubH° | 273. ± 18. | kJ/mol | TD-HFC | Al Takhin, Skinner, et al., 1983 |

References

Martinho Simões
Martinho Simões, J.A.,
Private communication (see http://webbook.nist.gov/chemistry/om/). [all data]
Palkin, Kuzina, et al., 1991
Palkin, V.A.; Kuzina, T.A.; Leonova, T.N.,
Thermodynamic properties of cis and trans isomers of dichlorobis(methylamine)platinum,
Zh. Neorg. Khim., 1991, 36(3), 697-701. [all data]
Al Takhin, Skinner, et al., 1983
Al Takhin, G.; Skinner, H.A.; Zaki, A.A.,
J. Chem. Soc., Dalton Trans., 1983, 2323.. [all data]