Tranid
- Formula: C10H12ClN3O2
- Molecular weight: 241.674
- IUPAC Standard InChIKey: QCQPGRMMDFIQMB-UHFFFAOYSA-N
- CAS Registry Number: 15271-41-7
- Chemical structure:
View 3d structure (requires JavaScript / HTML 5) - Other names: Bicyclo[2.2.1]heptane-2-carbonitrile, 5-chloro-6-[[[(methylamino)carbonyl]oxy]imino]-, [1S-(1α,2β,4α,5α,6E)]-; 2-Norbornanecarbonitrile, 5-chloro-6-oxo-, O-(methylcarbamoyl)oxime, (E)-endo-2,exo-5-; 2-Norbornanone, exo-3-chloro-endo-6-cyano-, O-(methylcarbamoyl)oxime, (E)-; exo-3-Chloro-endo-6-cyano-2-norbornanone O-(methylcarbamoyl)oxime; 3-exo-Chloro-E-6-endo-cyano-2-norbornanone-O-(methylcarbamoyl)oxime; 3-Chloro-6-cyano-2-norbornanone-O-(methylcarbamoyl)oxime, 3-exo, 6-endo, (E)-; 3-Chloro-6-cyanonorbornanone-2 oxime O,N-methylcarbamate; 5-Chloro-6-((((methylamino)carbonyl)oxy)imino)bicyclo(2.2.1)heptane-2-carbonitrile, (1S-(1α,2β,4α,5α,6E))-; exo-5-Chloro-6-oxo-endo-2-norbornanecarbonitrile O-(methylcarbamoyl)oxime; Bicyclo[2.2.1]heptane-2-carbonitrile, 5-chloro-6-[[[(methylamino)carbonyl]oxy]imino]-, (1S,2R,4R,5R,6E)-; ENT 25,962; 5-Chloro-6-[[[(methylamino)carbonyl]oxy]imino]bicyclo[2.2.1]-heptane-2-carbonitrile

Phase change data

Data compiled as indicated in comments:
TRC - Thermodynamics Research Center, NIST Boulder Laboratories, Chris Muzny director
AC - William E. Acree, Jr., James S. Chickos
Quantity | Value | Units | Method | Reference | Comment |
---|---|---|---|---|---|
Tfus | 433.40 | K | N/A | Donnelly, Drewes, et al., 1990 | Uncertainty assigned by TRC = 0.2 K; TRC |
Tfus | 431.4 | K | N/A | Plato and Glasgow, 1969 | Uncertainty assigned by TRC = 0.2 K; TRC |
Tfus | 430.6 | K | N/A | Plato and Glasgow, 1969 | Uncertainty assigned by TRC = 0.2 K; TRC |
Enthalpy of fusion
ΔfusH (kJ/mol) | Temperature (K) | Method | Reference | Comment |
---|---|---|---|---|
26.07 | 431.6 | DSC | Donnelly, Drewes, et al., 1990, 2 | AC |

References

Donnelly, Drewes, et al., 1990
Donnelly, J.R.; Drewes, L.A.; Johnson, R.L.; Munslow, W.D.; Knapp, K.K.; Sovocool, G.W.,
Purity and heat of fusion data for environmental standards as determined by differential scanning calorimetry,
Thermochim. Acta, 1990, 167, 2, 155, https://doi.org/10.1016/0040-6031(90)80476-F
. [all data]
Plato and Glasgow, 1969
Plato, C.; Glasgow, A.R., Jr.,
Differential scanning calorimetry as a general method for determining the purity and heat of fusion of high-purity organic chemicals. Application to 95 compounds,
Anal. Chem., 1969, 41, 2, 330, https://doi.org/10.1021/ac60271a041
. [all data]
Donnelly, Drewes, et al., 1990, 2
Donnelly, J.R.; Drewes, L.A.; Johnson, R.L.; Munslow, W.D.; Knapp, K.K.; Sovocool, G.W.,
Purity and heat of fusion data for environmental standards as determined by differential scanning calorimetry,
Thermochimica Acta, 1990, 167, 2, 155-187, https://doi.org/10.1016/0040-6031(90)80476-F
. [all data]