Cyclohexene, 3-heptyl-
- Formula: C13H24
- Molecular weight: 180.3297
- IUPAC Standard InChIKey: GPEVHZAJZYGTGA-UHFFFAOYSA-N
- CAS Registry Number: 15232-93-6
- Chemical structure:
View 3d structure (requires JavaScript / HTML 5) - Other names: 3-Heptyl-1-cyclohexene

Kovats' RI, non-polar column, isothermal

Column type | Active phase | Temperature (C) | I | Reference | Comment |
---|---|---|---|---|---|
Capillary | Squalane | 100. | 1342. | Rang, Orav, et al., 1977 | Nitrogen or helium; Column length: 100. m; Column diameter: 0.25 mm |

Kovats' RI, polar column, isothermal

Column type | Active phase | Temperature (C) | I | Reference | Comment |
---|---|---|---|---|---|
Capillary | PEG 4000 | 100. | 1489. | Rang, Orav, et al., 1988 | |
Capillary | PEG 4000 | 110. | 1501. | Rang, Orav, et al., 1988 | |
Capillary | PEG 4000 | 120. | 1506. | Rang, Orav, et al., 1988 | |
Capillary | PEG 4000 | 150. | 1518. | Rang, Orav, et al., 1988 | |
Capillary | PEG 4000 | 160. | 1523. | Rang, Orav, et al., 1988 | |
Capillary | PEG-20M | 100. | 1473. | Rang, Orav, et al., 1988 | |
Capillary | PEG-20M | 110. | 1480. | Rang, Orav, et al., 1988 | |
Capillary | PEG-20M | 120. | 1486. | Rang, Orav, et al., 1988 | |
Capillary | PEG-20M | 130. | 1492. | Rang, Orav, et al., 1988 | |
Capillary | PEG-20M | 140. | 1497. | Rang, Orav, et al., 1988 | |
Capillary | PEG-20M | 150. | 1503. | Rang, Orav, et al., 1988 | |
Capillary | PEG-20M | 160. | 1509. | Rang, Orav, et al., 1988 | |
Capillary | PEG-20M | 110. | 1480.3 | Orav, Kuningas, et al., 1982 | He; Column length: 100. m; Column diameter: 0.25 mm |
Capillary | PEG-20M | 120. | 1486.2 | Orav, Kuningas, et al., 1982 | He; Column length: 100. m; Column diameter: 0.25 mm |
Capillary | PEG-20M | 130. | 1492.2 | Orav, Kuningas, et al., 1982 | He; Column length: 100. m; Column diameter: 0.25 mm |
Capillary | PEG-20M | 140. | 1497.3 | Orav, Kuningas, et al., 1982 | He; Column length: 100. m; Column diameter: 0.25 mm |
Capillary | PEG-20M | 150. | 1503.2 | Orav, Kuningas, et al., 1982 | He; Column length: 100. m; Column diameter: 0.25 mm |
Capillary | PEG-20M | 160. | 1508.9 | Orav, Kuningas, et al., 1982 | He; Column length: 100. m; Column diameter: 0.25 mm |
Capillary | PEG 4000 | 100. | 1489. | Rang, Orav, et al., 1977 | Nitrogen or Helium; Column length: 45. m; Column diameter: 0.25 mm |

References

Rang, Orav, et al., 1977
Rang, S.; Orav, A.; Kuningas, K.; Eisen, O.,
Capillary Gas Chromatography of Monosubstituted Cyclopentenes and Cyclohexenes,
Chromatographia, 1977, 10, 3, 115-122, https://doi.org/10.1007/BF02297862
. [all data]
Rang, Orav, et al., 1988
Rang, S.A.; Orav, A.E.; Kuningas, K.R.; Meister, A.E.; Strense, T.V.; Eisen, O.G.,
Gas-Chromatographic Characteristics of unsaturated hydrocarbons, Academy of Sciences of Estonia SSR, Tallinn, Estonia SSR, 1988, 208. [all data]
Orav, Kuningas, et al., 1982
Orav, A.; Kuningas, K.; Rang, S.; Eisen, O.,
Capillary gas chromatography of monosubstituted cyclopentenes and cyclohexenes C8-C15 on polyethylene glycol 20M,
Eesti NSV Tead. Akad. Toim. Keem., 1982, 40-49. [all data]