Cyclohexene, 3-pentyl-
- Formula: C11H20
- Molecular weight: 152.2765
- IUPAC Standard InChIKey: OUBDONKLEWYBJJ-UHFFFAOYSA-N
- CAS Registry Number: 15232-92-5
- Chemical structure:
View 3d structure (requires JavaScript / HTML 5) - Other names: 3-Pentyl-1-cyclohexene

Kovats' RI, non-polar column, isothermal

Column type | Active phase | Temperature (C) | I | Reference | Comment |
---|---|---|---|---|---|
Capillary | Squalane | 100. | 1144. | Rang, Orav, et al., 1977 | Nitrogen or helium; Column length: 100. m; Column diameter: 0.25 mm |

Kovats' RI, polar column, isothermal

Column type | Active phase | Temperature (C) | I | Reference | Comment |
---|---|---|---|---|---|
Capillary | PEG 4000 | 100. | 1291. | Rang, Orav, et al., 1988 | |
Capillary | PEG 4000 | 110. | 1302. | Rang, Orav, et al., 1988 | |
Capillary | PEG 4000 | 120. | 1306. | Rang, Orav, et al., 1988 | |
Capillary | PEG 4000 | 150. | 1317. | Rang, Orav, et al., 1988 | |
Capillary | PEG 4000 | 160. | 1323. | Rang, Orav, et al., 1988 | |
Capillary | PEG-20M | 100. | 1276. | Rang, Orav, et al., 1988 | |
Capillary | PEG-20M | 110. | 1282. | Rang, Orav, et al., 1988 | |
Capillary | PEG-20M | 120. | 1287. | Rang, Orav, et al., 1988 | |
Capillary | PEG-20M | 130. | 1292. | Rang, Orav, et al., 1988 | |
Capillary | PEG-20M | 140. | 1298. | Rang, Orav, et al., 1988 | |
Capillary | PEG-20M | 80. | 1265. | Rang, Orav, et al., 1988 | |
Capillary | PEG-20M | 90. | 1270. | Rang, Orav, et al., 1988 | |
Capillary | PEG-20M | 100. | 1275.9 | Orav, Kuningas, et al., 1982 | He; Column length: 100. m; Column diameter: 0.25 mm |
Capillary | PEG-20M | 110. | 1281.6 | Orav, Kuningas, et al., 1982 | He; Column length: 100. m; Column diameter: 0.25 mm |
Capillary | PEG-20M | 120. | 1287.0 | Orav, Kuningas, et al., 1982 | He; Column length: 100. m; Column diameter: 0.25 mm |
Capillary | PEG-20M | 130. | 1292.3 | Orav, Kuningas, et al., 1982 | He; Column length: 100. m; Column diameter: 0.25 mm |
Capillary | PEG-20M | 140. | 1298. | Orav, Kuningas, et al., 1982 | He; Column length: 100. m; Column diameter: 0.25 mm |
Capillary | PEG-20M | 80. | 1264.6 | Orav, Kuningas, et al., 1982 | He; Column length: 100. m; Column diameter: 0.25 mm |
Capillary | PEG-20M | 90. | 1270.4 | Orav, Kuningas, et al., 1982 | He; Column length: 100. m; Column diameter: 0.25 mm |
Capillary | PEG 4000 | 100. | 1291. | Rang, Orav, et al., 1977 | Nitrogen or Helium; Column length: 45. m; Column diameter: 0.25 mm |

References

Rang, Orav, et al., 1977
Rang, S.; Orav, A.; Kuningas, K.; Eisen, O.,
Capillary Gas Chromatography of Monosubstituted Cyclopentenes and Cyclohexenes,
Chromatographia, 1977, 10, 3, 115-122, https://doi.org/10.1007/BF02297862
. [all data]
Rang, Orav, et al., 1988
Rang, S.A.; Orav, A.E.; Kuningas, K.R.; Meister, A.E.; Strense, T.V.; Eisen, O.G.,
Gas-Chromatographic Characteristics of unsaturated hydrocarbons, Academy of Sciences of Estonia SSR, Tallinn, Estonia SSR, 1988, 208. [all data]
Orav, Kuningas, et al., 1982
Orav, A.; Kuningas, K.; Rang, S.; Eisen, O.,
Capillary gas chromatography of monosubstituted cyclopentenes and cyclohexenes C8-C15 on polyethylene glycol 20M,
Eesti NSV Tead. Akad. Toim. Keem., 1982, 40-49. [all data]