Cyclohexene, 1-nonyl-
- Formula: C15H28
- Molecular weight: 208.3828
- IUPAC Standard InChIKey: GTEZIRITHHEDAC-UHFFFAOYSA-N
- CAS Registry Number: 15232-88-9
- Chemical structure:
View 3d structure (requires JavaScript / HTML 5) - Other names: 1-Nonyl-1-cyclohexene

Kovats' RI, polar column, isothermal

Column type | Active phase | Temperature (C) | I | Reference | Comment |
---|---|---|---|---|---|
Capillary | PEG 4000 | 100. | 1680. | Rang, Orav, et al., 1988 | |
Capillary | PEG 4000 | 120. | 1701. | Rang, Orav, et al., 1988 | |
Capillary | PEG 4000 | 150. | 1712. | Rang, Orav, et al., 1988 | |
Capillary | PEG 4000 | 160. | 1716. | Rang, Orav, et al., 1988 | |
Capillary | PEG-20M | 100. | 1665. | Rang, Orav, et al., 1988 | |
Capillary | PEG-20M | 130. | 1685. | Rang, Orav, et al., 1988 | |
Capillary | PEG-20M | 140. | 1691. | Rang, Orav, et al., 1988 | |
Capillary | PEG-20M | 150. | 1697. | Rang, Orav, et al., 1988 | |
Capillary | PEG-20M | 160. | 1702. | Rang, Orav, et al., 1988 | |
Capillary | PEG-20M | 130. | 1685.0 | Orav, Kuningas, et al., 1982 | He; Column length: 100. m; Column diameter: 0.25 mm |
Capillary | PEG-20M | 140. | 1690.9 | Orav, Kuningas, et al., 1982 | He; Column length: 100. m; Column diameter: 0.25 mm |
Capillary | PEG-20M | 150. | 1696.9 | Orav, Kuningas, et al., 1982 | He; Column length: 100. m; Column diameter: 0.25 mm |
Capillary | PEG-20M | 160. | 1702.0 | Orav, Kuningas, et al., 1982 | He; Column length: 100. m; Column diameter: 0.25 mm |
Capillary | PEG 4000 | 100. | 1680. | Rang, Orav, et al., 1977 | Nitrogen or Helium; Column length: 45. m; Column diameter: 0.25 mm |

References

Rang, Orav, et al., 1988
Rang, S.A.; Orav, A.E.; Kuningas, K.R.; Meister, A.E.; Strense, T.V.; Eisen, O.G.,
Gas-Chromatographic Characteristics of unsaturated hydrocarbons, Academy of Sciences of Estonia SSR, Tallinn, Estonia SSR, 1988, 208. [all data]
Orav, Kuningas, et al., 1982
Orav, A.; Kuningas, K.; Rang, S.; Eisen, O.,
Capillary gas chromatography of monosubstituted cyclopentenes and cyclohexenes C8-C15 on polyethylene glycol 20M,
Eesti NSV Tead. Akad. Toim. Keem., 1982, 40-49. [all data]
Rang, Orav, et al., 1977
Rang, S.; Orav, A.; Kuningas, K.; Eisen, O.,
Capillary Gas Chromatography of Monosubstituted Cyclopentenes and Cyclohexenes,
Chromatographia, 1977, 10, 3, 115-122, https://doi.org/10.1007/BF02297862
. [all data]