Cyclohexene, 1-octyl-
- Formula: C14H26
- Molecular weight: 194.3562
- IUPAC Standard InChIKey: AHNZGLABLPCXKB-UHFFFAOYSA-N
- CAS Registry Number: 15232-87-8
- Chemical structure:
View 3d structure (requires JavaScript / HTML 5) - Other names: 1-Octyl-1-cyclohexene

Phase change data

Data compiled by: Thermodynamics Research Center, NIST Boulder Laboratories, Chris Muzny director
Quantity | Value | Units | Method | Reference | Comment |
---|---|---|---|---|---|
Tfus | 220.7 | K | N/A | Schmidt and Schoeller, 1942 | Uncertainty assigned by TRC = 3. K |

Kovats' RI, polar column, isothermal

Column type | Active phase | Temperature (C) | I | Reference | Comment |
---|---|---|---|---|---|
Capillary | PEG 4000 | 100. | 1583. | Rang, Orav, et al., 1988 | |
Capillary | PEG 4000 | 110. | 1595. | Rang, Orav, et al., 1988 | |
Capillary | PEG 4000 | 120. | 1600. | Rang, Orav, et al., 1988 | |
Capillary | PEG 4000 | 150. | 1612. | Rang, Orav, et al., 1988 | |
Capillary | PEG 4000 | 160. | 1617. | Rang, Orav, et al., 1988 | |
Capillary | PEG-20M | 100. | 1567. | Rang, Orav, et al., 1988 | |
Capillary | PEG-20M | 120. | 1580. | Rang, Orav, et al., 1988 | |
Capillary | PEG-20M | 130. | 1586. | Rang, Orav, et al., 1988 | |
Capillary | PEG-20M | 140. | 1592. | Rang, Orav, et al., 1988 | |
Capillary | PEG-20M | 150. | 1598. | Rang, Orav, et al., 1988 | |
Capillary | PEG-20M | 160. | 1603. | Rang, Orav, et al., 1988 | |
Capillary | PEG-20M | 120. | 1580.5 | Orav, Kuningas, et al., 1982 | He; Column length: 100. m; Column diameter: 0.25 mm |
Capillary | PEG-20M | 130. | 1586.3 | Orav, Kuningas, et al., 1982 | He; Column length: 100. m; Column diameter: 0.25 mm |
Capillary | PEG-20M | 140. | 1592. | Orav, Kuningas, et al., 1982 | He; Column length: 100. m; Column diameter: 0.25 mm |
Capillary | PEG-20M | 150. | 1598.1 | Orav, Kuningas, et al., 1982 | He; Column length: 100. m; Column diameter: 0.25 mm |
Capillary | PEG-20M | 160. | 1602.8 | Orav, Kuningas, et al., 1982 | He; Column length: 100. m; Column diameter: 0.25 mm |
Capillary | PEG 4000 | 100. | 1583. | Rang, Orav, et al., 1977 | Nitrogen or Helium; Column length: 45. m; Column diameter: 0.25 mm |

References

Schmidt and Schoeller, 1942
Schmidt, A.W.; Schoeller, V.,
The Polymerization of CHemically Unsaturated Hydrocarbons to Substances Resembling Lubrication Oils,
Brennst.-Chem., 1942, 23, 235. [all data]
Rang, Orav, et al., 1988
Rang, S.A.; Orav, A.E.; Kuningas, K.R.; Meister, A.E.; Strense, T.V.; Eisen, O.G.,
Gas-Chromatographic Characteristics of unsaturated hydrocarbons, Academy of Sciences of Estonia SSR, Tallinn, Estonia SSR, 1988, 208. [all data]
Orav, Kuningas, et al., 1982
Orav, A.; Kuningas, K.; Rang, S.; Eisen, O.,
Capillary gas chromatography of monosubstituted cyclopentenes and cyclohexenes C8-C15 on polyethylene glycol 20M,
Eesti NSV Tead. Akad. Toim. Keem., 1982, 40-49. [all data]
Rang, Orav, et al., 1977
Rang, S.; Orav, A.; Kuningas, K.; Eisen, O.,
Capillary Gas Chromatography of Monosubstituted Cyclopentenes and Cyclohexenes,
Chromatographia, 1977, 10, 3, 115-122, https://doi.org/10.1007/BF02297862
. [all data]