Cyclohexene,3-hexyl-
- Formula: C12H22
- Molecular weight: 166.3031
- IUPAC Standard InChIKey: OQKLIIQHYMWPMF-UHFFFAOYSA-N
- CAS Registry Number: 15232-78-7
- Chemical structure:
View 3d structure (requires JavaScript / HTML 5) - Other names: 3-hexyl-1-cyclohexene

Kovats' RI, non-polar column, isothermal

Column type | Active phase | Temperature (C) | I | Reference | Comment |
---|---|---|---|---|---|
Capillary | Squalane | 100. | 1243. | Rang, Orav, et al., 1977 | Nitrogen or helium; Column length: 100. m; Column diameter: 0.25 mm |

Kovats' RI, polar column, isothermal

Column type | Active phase | Temperature (C) | I | Reference | Comment |
---|---|---|---|---|---|
Capillary | PEG-20M | 80. | 1344.3 | Orav, Kuningas, et al., 1994 | 50. m/0.2 mm/0.13 μm, He |
Capillary | PEG-20M | 80. | 1352.0 | Orav, Kuningas, et al., 1994 | 50. m/0.2 mm/0.19 μm, He |
Capillary | PEG-20M | 80. | 1355.7 | Orav, Kuningas, et al., 1994 | 50. m/0.2 mm/0.22 μm, He |
Capillary | PEG 4000 | 100. | 1390. | Rang, Orav, et al., 1988 | |
Capillary | PEG 4000 | 110. | 1401. | Rang, Orav, et al., 1988 | |
Capillary | PEG 4000 | 120. | 1406. | Rang, Orav, et al., 1988 | |
Capillary | PEG 4000 | 150. | 1417. | Rang, Orav, et al., 1988 | |
Capillary | PEG 4000 | 160. | 1423. | Rang, Orav, et al., 1988 | |
Capillary | PEG-20M | 100. | 1375. | Rang, Orav, et al., 1988 | |
Capillary | PEG-20M | 110. | 1381. | Rang, Orav, et al., 1988 | |
Capillary | PEG-20M | 120. | 1387. | Rang, Orav, et al., 1988 | |
Capillary | PEG-20M | 130. | 1392. | Rang, Orav, et al., 1988 | |
Capillary | PEG-20M | 140. | 1398. | Rang, Orav, et al., 1988 | |
Capillary | PEG-20M | 150. | 1403. | Rang, Orav, et al., 1988 | |
Capillary | PEG-20M | 160. | 1409. | Rang, Orav, et al., 1988 | |
Capillary | PEG-20M | 100. | 1375.2 | Orav, Kuningas, et al., 1982 | He; Column length: 100. m; Column diameter: 0.25 mm |
Capillary | PEG-20M | 110. | 1381. | Orav, Kuningas, et al., 1982 | He; Column length: 100. m; Column diameter: 0.25 mm |
Capillary | PEG-20M | 120. | 1386.7 | Orav, Kuningas, et al., 1982 | He; Column length: 100. m; Column diameter: 0.25 mm |
Capillary | PEG-20M | 130. | 1392.3 | Orav, Kuningas, et al., 1982 | He; Column length: 100. m; Column diameter: 0.25 mm |
Capillary | PEG-20M | 140. | 1397.9 | Orav, Kuningas, et al., 1982 | He; Column length: 100. m; Column diameter: 0.25 mm |
Capillary | PEG-20M | 150. | 1402.8 | Orav, Kuningas, et al., 1982 | He; Column length: 100. m; Column diameter: 0.25 mm |
Capillary | PEG-20M | 160. | 1409.2 | Orav, Kuningas, et al., 1982 | He; Column length: 100. m; Column diameter: 0.25 mm |
Capillary | PEG 4000 | 100. | 1390. | Rang, Orav, et al., 1977 | Nitrogen or Helium; Column length: 45. m; Column diameter: 0.25 mm |

Gas phase ion energetics data

Data compiled by: Sharon G. Lias, Rhoda D. Levin, and Sherif A. Kafafi

Ionization energy determinations

IE (eV) Method Reference
8.78 ± 0.01PERang, Paldoia, et al., 1974

References

Rang, Orav, et al., 1977
Rang, S.; Orav, A.; Kuningas, K.; Eisen, O.,
Capillary Gas Chromatography of Monosubstituted Cyclopentenes and Cyclohexenes,
Chromatographia, 1977, 10, 3, 115-122, https://doi.org/10.1007/BF02297862
. [all data]
Orav, Kuningas, et al., 1994
Orav, A.; Kuningas, K.; Kailas, T.; Koplimets, E.; Rang, S.,
Effect of adsorption on the retention values in capillary columns coated with OV-225 and PEG 20M,
J. Chromatogr. A, 1994, 659, 1, 143-150, https://doi.org/10.1016/0021-9673(94)85016-X
. [all data]
Rang, Orav, et al., 1988
Rang, S.A.; Orav, A.E.; Kuningas, K.R.; Meister, A.E.; Strense, T.V.; Eisen, O.G.,
Gas-Chromatographic Characteristics of unsaturated hydrocarbons, Academy of Sciences of Estonia SSR, Tallinn, Estonia SSR, 1988, 208. [all data]
Orav, Kuningas, et al., 1982
Orav, A.; Kuningas, K.; Rang, S.; Eisen, O.,
Capillary gas chromatography of monosubstituted cyclopentenes and cyclohexenes C8-C15 on polyethylene glycol 20M,
Eesti NSV Tead. Akad. Toim. Keem., 1982, 40-49. [all data]