Pentaerythrityl tetraiodide
- Formula: C5H8I4
- Molecular weight: 575.7349
- IUPAC Standard InChIKey: HPMGSGCDKVCZHC-UHFFFAOYSA-N
- CAS Registry Number: 1522-88-9
- Chemical structure:
View 3d structure (requires JavaScript / HTML 5) - Other names: Methane, tetrakis(iodomethyl)-; Pentaerythritol tetraiodide; Pentaerythrityl iodide; Pentaerythryl tetraiodide; Propane, 1,3-diiodo-2,2-bis(iodomethyl)-; Propane, 2,2-bis(iodomethyl)-1,3-diiodo-; 2,2-Bis(iodomethyl)-1,3-diiodopropane

Condensed phase thermochemistry data

Data compiled by: Eugene S. Domalski and Elizabeth D. Hearing
Quantity | Value | Units | Method | Reference | Comment |
---|---|---|---|---|---|
S°solid,1 bar | 316.94 | J/mol*K | N/A | Clever, Wong, et al., 1965 | Based on low temperature data of Payne and Westrum, 1962 |
S°solid,1 bar | 316.73 | J/mol*K | N/A | Payne and Westrum, 1962 |
Constant pressure heat capacity of solid
Cp,solid (J/mol*K) | Temperature (K) | Reference | Comment |
---|---|---|---|
209.62 | 298.15 | Clever, Wong, et al., 1965 | T = 260 to 420 K. |
207.70 | 298.15 | Payne and Westrum, 1962 | T = 6 to 300 K. |
207.69 | 298.15 | Westrum, 1959 | Based on data 10 to 350 K, to be reported elsewhere. |

References

Clever, Wong, et al., 1965
Clever, H.L.; Wong, W-K.; Westrum, E.F., Jr.,
Heat capacities and thermodynamic properties of globular molecules. XIII. Transition and fusion of pentaerythrityl chloride and bromide, transition of pentaerythrityl iodide,
J. Phys. Chem., 1965, 69, 1209-1213. [all data]
Payne and Westrum, 1962
Payne, D.H.; Westrum, E.F., Jr.,
Heat capacities and thermodynamic properties of globular molecules. IV. Pentaerythrityl chloride, bromide, and iodide from 6 to 300°K,
J. Phys. Chem., 1962, 66, 748-751. [all data]
Westrum, 1959
Westrum, E.F., Jr.,
Ordering transitions in symmetrical molecules, Symp. Thermodynam. Fritens-Wattens,
Tirol Austria, 1959, No.36, 11p. [all data]