Cyclohexene, 3-bromo-
- Formula: C6H9Br
- Molecular weight: 161.040
- IUPAC Standard InChIKey: AJKDUJRRWLQXHM-UHFFFAOYSA-N
- CAS Registry Number: 1521-51-3
- Chemical structure:
View 3d structure (requires JavaScript / HTML 5) - Other names: 1-Bromo-2-cyclohexene; 2-Cyclohexen-1-yl bromide; 3-Bromo-1-cyclohexene; 3-Bromocyclohexene; 2-Cyclohexenyl bromide

Phase change data

Data compiled by: Robert L. Brown and Stephen E. Stein
Reduced pressure boiling point
Tboil (K) | Pressure (bar) | Reference |
---|---|---|
337. to 338. | 0.020 | Frinton Laboratories Inc., 1986 |
329. to 330. | 0.015 | Buckingham and Donaghy, 1982 |

Normal alkane RI, non-polar column, custom temperature program

Column type | Active phase | I | Reference | Comment |
---|---|---|---|---|
Packed | SE-30 | 974. | Buchman, Cao, et al., 1984 | He, Chromosorb AW; Column length: 3.05 m; Program: not specified |

References

Frinton Laboratories Inc., 1986
Frinton Laboratories Inc.,
Catalog Number 11, Frinton Laboratories Inc., Vineland, NJ, 1986, 99. [all data]
Buckingham and Donaghy, 1982
Buckingham, J.; Donaghy, S.M.,
Dictionary of Organic Compounds: Fifth Edition, Chapman and Hall, New York, 1982, 1. [all data]
Buchman, Cao, et al., 1984
Buchman, O.; Cao, G.-Y.; Peng, C.T.,
Structure assignment by retention index in gas-liquid radiochromatography of substituted cyclohexenes,
J. Chromatogr., 1984, 312, 75-90, https://doi.org/10.1016/S0021-9673(01)92765-7
. [all data]