Perylene-D12
- Formula: C20D12
- Molecular weight: 264.3832
- IUPAC Standard InChIKey: CSHWQDPOILHKBI-AQZSQYOVSA-N
- CAS Registry Number: 1520-96-3
- Chemical structure:
View 3d structure (requires JavaScript / HTML 5) - Isotopologues:
- Other names: Perylene, perdeutero-; [2H12]Perylene; D12-Perylene (ISTD); Perylene - d12

Phase change data

Data compiled by: William E. Acree, Jr., James S. Chickos
Quantity | Value | Units | Method | Reference | Comment |
---|---|---|---|---|---|
ΔvapH° | 119.5 | kJ/mol | CGC | Zhao, Unhannanant, et al., 2008 |

Lee's RI, non-polar column, temperature ramp

Column type | Active phase | I | Reference | Comment |
---|---|---|---|---|
Capillary | DB-5 | 442.3 | Donnelly, Abdel-Hamid, et al., 1993 | 30. m/0.32 mm/0.25 μm, He, 40. C @ 3. min, 8. K/min, 285. C @ 29.5 min |

Lee's RI, non-polar column, custom temperature program

Column type | Active phase | I | Reference | Comment |
---|---|---|---|---|
Capillary | HP-5 | 456.04 | Reckendorf, 1997 | 25. m/0.2 mm/0.11 μm, He; Program: 106C(0.2min) => 40C/min => 120C => 3C/min => 310C(10min) |

References

Zhao, Unhannanant, et al., 2008
Zhao, Hui; Unhannanant, Patamaporn; Hanshaw, William; Chickos, James S.,
Enthalpies of Vaporization and Vapor Pressures of Some Deuterated Hydrocarbons. Liquid-Vapor Pressure Isotope Effects,
J. Chem. Eng. Data, 2008, 53, 7, 1545-1556, https://doi.org/10.1021/je800091s
. [all data]
Donnelly, Abdel-Hamid, et al., 1993
Donnelly, J.R.; Abdel-Hamid, M.S.; Jeter, J.L.; Gurka, D.F.,
Application of gas chromatographic retention properties to the identification of environmental contaminants,
J. Chromatogr., 1993, 642, 1-2, 409-415, https://doi.org/10.1016/0021-9673(93)80106-I
. [all data]
Reckendorf, 1997
Reckendorf, R.M.,
Identification of phenyl-substituted polycyclic aromatic compounds in ring furnace gases using GC-MS and GC-AED,
Chromatographia, 1997, 45, 1, 173-182, https://doi.org/10.1007/BF02505557
. [all data]