4-Aminostyrene
- Formula: C8H9N
- Molecular weight: 119.1638
- IUPAC Standard InChIKey: LBSXSAXOLABXMF-UHFFFAOYSA-N
- CAS Registry Number: 1520-21-4
- Chemical structure:
View 3d structure (requires JavaScript / HTML 5) - Other names: Benzenamine, 4-ethenyl-; p-Aminostyrene; Aniline, p-vinyl-; 4-vinylaniline

Phase change data

Data compiled by: Robert L. Brown and Stephen E. Stein
Quantity | Value | Units | Method | Reference | Comment |
---|---|---|---|---|---|
Tfus | 298. | K | N/A | Buckingham and Donaghy, 1982 |
Reduced pressure boiling point
Tboil (K) | Pressure (bar) | Reference |
---|---|---|
389.2 | 0.01 | Weast and Grasselli, 1989 |
388. to 390. | 0.01 to 0.013 | Buckingham and Donaghy, 1982 |
347. to 350. | 0.003 | Buckingham and Donaghy, 1982 |

References

Buckingham and Donaghy, 1982
Buckingham, J.; Donaghy, S.M.,
Dictionary of Organic Compounds: Fifth Edition, Chapman and Hall, New York, 1982, 1. [all data]
Weast and Grasselli, 1989
CRC Handbook of Data on Organic Compounds, 2nd Editon, Weast,R.C and Grasselli, J.G., ed(s)., CRC Press, Inc., Boca Raton, FL, 1989, 1. [all data]