CH3 anion
- Formula: CH3-
- Molecular weight: 15.0351
- CAS Registry Number: 15194-58-8

Reaction thermochemistry data

Data compiled by: John E. Bartmess
Individual Reactions
Quantity | Value | Units | Method | Reference | Comment |
---|---|---|---|---|---|
ΔrH° | 1743.6 ± 2.9 | kJ/mol | D-EA | Ellison, Engelking, et al., 1978 | gas phase |
ΔrH° | 1749. ± 15. | kJ/mol | CIDT | Graul and Squires, 1990 | gas phase |
ΔrH° | >1691.1 ± 0.42 | kJ/mol | G+TS | Bohme, Lee-Ruff, et al., 1972 | gas phase |
ΔrH° | 1735.5 | kJ/mol | N/A | Check, Faust, et al., 2001 | gas phase; FeBr3; ; ΔS(EA)=9.3 |
Quantity | Value | Units | Method | Reference | Comment |
ΔrG° | 1709.8 ± 3.3 | kJ/mol | H-TS | Ellison, Engelking, et al., 1978 | gas phase |
ΔrG° | 1715. ± 15. | kJ/mol | H-TS | Graul and Squires, 1990 | gas phase |
ΔrG° | >1657.3 | kJ/mol | IMRB | Bohme, Lee-Ruff, et al., 1972 | gas phase |
ΔrG° | 1704.1 | kJ/mol | N/A | Check, Faust, et al., 2001 | gas phase; FeBr3; ; ΔS(EA)=9.3 |
By formula: (CH3- • 4294967295CH2) + CH2 = CH3-
Quantity | Value | Units | Method | Reference | Comment |
---|---|---|---|---|---|
ΔrH° | 397.4 ± 3.3 | kJ/mol | N/A | Ellison, Engelking, et al., 1978 | gas phase |

Gas phase ion energetics data

Data compiled by: John E. Bartmess
Protonation reactions
Quantity | Value | Units | Method | Reference | Comment |
---|---|---|---|---|---|
ΔrH° | 1743.6 ± 2.9 | kJ/mol | D-EA | Ellison, Engelking, et al., 1978 | gas phase |
ΔrH° | 1749. ± 15. | kJ/mol | CIDT | Graul and Squires, 1990 | gas phase |
ΔrH° | >1691.1 ± 0.42 | kJ/mol | G+TS | Bohme, Lee-Ruff, et al., 1972 | gas phase |
ΔrH° | 1735.5 | kJ/mol | N/A | Check, Faust, et al., 2001 | gas phase; FeBr3; ; ΔS(EA)=9.3 |
Quantity | Value | Units | Method | Reference | Comment |
ΔrG° | 1709.8 ± 3.3 | kJ/mol | H-TS | Ellison, Engelking, et al., 1978 | gas phase |
ΔrG° | 1715. ± 15. | kJ/mol | H-TS | Graul and Squires, 1990 | gas phase |
ΔrG° | >1657.3 | kJ/mol | IMRB | Bohme, Lee-Ruff, et al., 1972 | gas phase |
ΔrG° | 1704.1 | kJ/mol | N/A | Check, Faust, et al., 2001 | gas phase; FeBr3; ; ΔS(EA)=9.3 |

Ion clustering data

Data compiled by: John E. Bartmess
Clustering reactions
By formula: (CH3- • 4294967295CH2) + CH2 = CH3-
Quantity | Value | Units | Method | Reference | Comment |
---|---|---|---|---|---|
ΔrH° | 397.4 ± 3.3 | kJ/mol | N/A | Ellison, Engelking, et al., 1978 | gas phase |

Vibrational and/or electronic energy levels

Data compiled by: Marilyn E. Jacox

State:   ?

 Energy
 (cm-1
 Med.   Transition   λmin
 (nm)
 λmax
 (nm)

References

Ellison, Engelking, et al., 1978
Ellison, G.B.; Engelking, P.C.; Lineberger, W.C.,
An experimental determination of the geometry and electron affinity of CH3,
J. Am. Chem. Soc., 1978, 100, 2556. [all data]
Graul and Squires, 1990
Graul, S.T.; Squires, R.R.,
Gas-Phase Acidities Derived from Threshold Energies for Activated Reactions,
J. Am. Chem. Soc., 1990, 112, 7, 2517, https://doi.org/10.1021/ja00163a007
. [all data]
Bohme, Lee-Ruff, et al., 1972
Bohme, D.K.; Lee-Ruff, E.; Young, L.B.,
Acidity order of selected bronsted acids in the gas phase at 300K,
J. Am. Chem. Soc., 1972, 94, 5153. [all data]
Check, Faust, et al., 2001
Check, C.E.; Faust, T.O.; Bailey, J.M.; Wright, B.J.; Gilbert, T.M.; Sunderlin, L.S.,
Addition of Polarization and Diffuse Functions to the LANL2DZ Basis Set for P-Block Elements,
J. Phys. Chem. A,, 2001, 105, 34, 8111, https://doi.org/10.1021/jp011945l
. [all data]