Tetracyano-p-quinodimethane
- Formula: C12H4N4
- Molecular weight: 204.1870
- IUPAC Standard InChIKey: PCCVSPMFGIFTHU-UHFFFAOYSA-N
- CAS Registry Number: 1518-16-7
- Chemical structure:
View 3d structure (requires JavaScript / HTML 5) - Other names: Propanedinitrile, 2,2'-(2,5-cyclohexadiene-1,4-diylidene)bis-; 2,5-Cyclohexadiene-δ1,α:4,α'-dimalononitrile; Quinodimethan, tetracyano-; Tetracyanoquinodimethan(e); TCNQ; 2,5-Cyclohexadiene-1,4-Diylidenedimalononitrile; 7,7,8,8-Tetracyano-p-quinodimethane; 7,7,8,8-Tetracyano-1,4-quinodimethan; 7,7,8,8-Tetracyanoquinodimethane; 7,7',8,8'-Tetracyanoquinodimethane; 2,5-Cyclohexadiene-1,4-diylidene-α,α'-dimalononitrile; Tetracyanoquinodimethan; NSC 105237; 2,2'-(2,5-cyclohexadiene-1,4-diylidene)bismalononitrile

Gas phase thermochemistry data

Data compiled as indicated in comments:
DRB - Donald R. Burgess, Jr.
ALS - Hussein Y. Afeefy, Joel F. Liebman, and Stephen E. Stein
Quantity | Value | Units | Method | Reference | Comment |
---|---|---|---|---|---|
ΔfH°gas | 771.1 | kJ/mol | N/A | Metzger, Kuo, et al., 1983 | Value computed using ΔfHsolid° value of 666.1±5.9 kj/mol from Metzger, Kuo, et al., 1983 and ΔsubH° value of 105.0 kj/mol from Boyd, 1963.; DRB |
ΔfH°gas | 770. ± 10. | kJ/mol | Ccb | Boyd, 1963 | ALS |

Condensed phase thermochemistry data

Data compiled by: Hussein Y. Afeefy, Joel F. Liebman, and Stephen E. Stein
Quantity | Value | Units | Method | Reference | Comment |
---|---|---|---|---|---|
ΔfH°solid | 666.1 ± 5.9 | kJ/mol | Ccr | Metzger, Kuo, et al., 1983 | see Metzger, 1977 |
ΔfH°solid | 665. ± 3. | kJ/mol | Ccb | Boyd, 1963 | |
Quantity | Value | Units | Method | Reference | Comment |
ΔcH°solid | -5958.9 ± 5.7 | kJ/mol | Ccr | Metzger, Kuo, et al., 1983 | see Metzger, 1977 |
ΔcH°solid | -5959. ± 3. | kJ/mol | Ccb | Boyd, 1963 |

Phase change data

Data compiled as indicated in comments:
TRC - Thermodynamics Research Center, NIST Boulder Laboratories, Chris Muzny director
ALS - Hussein Y. Afeefy, Joel F. Liebman, and Stephen E. Stein
DRB - Donald R. Burgess, Jr.
AC - William E. Acree, Jr., James S. Chickos
Quantity | Value | Units | Method | Reference | Comment |
---|---|---|---|---|---|
Tfus | 567. | K | N/A | Metzger, Kuo, et al., 1983, 2 | Uncertainty assigned by TRC = 2. K; TRC |
Quantity | Value | Units | Method | Reference | Comment |
ΔsubH° | 105. | kJ/mol | V | Boyd, 1963 | ALS |
ΔsubH° | 105.0 | kJ/mol | N/A | Boyd, 1963 | DRB |
Enthalpy of sublimation
ΔsubH (kJ/mol) | Temperature (K) | Method | Reference | Comment |
---|---|---|---|---|
108. ± 2. | 500. | T | Kersten and Oppermann, 1984 | Based on data from 452. to 553. K.; AC |
122. ± 2. | 423. | ME | Kersten and Oppermann, 1984 | Based on data from 382. to 464. K.; AC |
126. ± 1. | 413. | ME,TE | de Kruif and Govers, 1980 | AC |
105. ± 10. | 448. | N/A | Swain, Kwan, et al., 1980 | Based on data from 433. to 499. K. See also Stephenson and Malanowski, 1987.; AC |
105. ± 9.2 | 465. | MG | Boyd, 1963, 2 | See also Cox and Pilcher, 1970.; AC |

Gas phase ion energetics data

Data compiled by: John E. Bartmess
Electron affinity determinations
EA (eV) | Method | Reference | Comment |
---|---|---|---|
2.80 ± 0.30 | NBIE | Compton and Cooper, 1977 | The neutral HOF is not in 94PED, but this value agrees very well with G3B calculations. |
2.80 ± 0.10 | NBIE | Klots, Compton, et al., 1974 | Bound excited states: Brinkman, Gunther, et al., 1994. |
2.80 ± 0.10 | SI | Nazarenko and Pokhodenko, 1979 | The Magnetron method, lacking mass analysis, is not considered reliable. |
2.88 ± 0.19 | SI | Farragher and Page, 1967 | The Magnetron method, lacking mass analysis, is not considered reliable. |

References

Metzger, Kuo, et al., 1983
Metzger, R.M.; Kuo, C.S.; Arafat, E.S.,
A semi-micro rotating-bomb combustion calorimeter,
J. Chem. Thermodyn., 1983, 15, 841-851. [all data]
Boyd, 1963
Boyd, R.H.,
Thermochemistry of cyanocarbons,
J. Chem. Phys., 1963, 38, 2529-2535. [all data]
Metzger, 1977
Metzger, R.M.,
The enthalpy of formation and the experimental crystal binding energy of tetrathiofulvalenium 7,7,8,8-tetracyanoquinodimethanide (TTF TCNQ),
J. Chem. Phys., 1977, 66, 2525-2533. [all data]
Metzger, Kuo, et al., 1983, 2
Metzger, R.M.; Kuo, C.S.; Arafat, E.S.,
A semi-micro rotating-bomb combustion calorimeter,
J. Chem. Thermodyn., 1983, 15, 841. [all data]
Kersten and Oppermann, 1984
Kersten, von F.; Oppermann, H.,
Z. Phys. Chem. (Leipzig), 1984, 265, 1207. [all data]
de Kruif and Govers, 1980
de Kruif, C.G.; Govers, H.A.J.,
Enthalpies of sublimation and vapor pressures of 2,2´-bis-1,3-dithiole (TTF), 7,7,8,8-tetracyanoquinodimethane (TCNQ), and TTF--TCNQ (1:1),
J. Chem. Phys., 1980, 73, 1, 553, https://doi.org/10.1063/1.439854
. [all data]
Swain, Kwan, et al., 1980
Swain, H.A.; Kwan, Chiu-Yin; Sung, Ho-Nan,
Measurement of vapor pressures from 20 to 30.degree.C of long-chain peroxy acids,
J. Phys. Chem., 1980, 84, 11, 1347-1349, https://doi.org/10.1021/j100448a012
. [all data]
Stephenson and Malanowski, 1987
Stephenson, Richard M.; Malanowski, Stanislaw,
Handbook of the Thermodynamics of Organic Compounds, 1987, https://doi.org/10.1007/978-94-009-3173-2
. [all data]
Boyd, 1963, 2
Boyd, Richard H.,
Thermochemistry of Cyanocarbons,
J. Chem. Phys., 1963, 38, 10, 2529, https://doi.org/10.1063/1.1733536
. [all data]
Cox and Pilcher, 1970
Cox, J.D.; Pilcher, G.,
Thermochemistry of Organic and Organometallic Compounds, Academic Press Inc., London, 1970, 643. [all data]
Compton and Cooper, 1977
Compton, R.N.; Cooper, C.D.,
Negative ion properties of tetracyanoquinodimethane: Electron affinity and compound states,
J. Chem. Phys., 1977, 66, 4325. [all data]
Klots, Compton, et al., 1974
Klots, C.E.; Compton, R.N.; Raaen, V.F.,
Electronic and ionic properties of of molecular TTF and TCMQ,
J. Chem. Phys., 1974, 60, 1177. [all data]
Brinkman, Gunther, et al., 1994
Brinkman, E.A.; Gunther, E.; Schafer, O.; Brauman, J.I.,
Bound Excited Electronic States of Anions,
J. Chem. Phys., 1994, 100, 3, 1840, https://doi.org/10.1063/1.466535
. [all data]
Nazarenko and Pokhodenko, 1979
Nazarenko, V.A.; Pokhodenko, V.D.,
The formation of negative ions in high electric fields,
Int. J. Mass Spectrom. Ion Phys., 1979, 31, 381. [all data]
Farragher and Page, 1967
Farragher, A.L.; Page, F.M.,
Experimental Determination of Electron Affinities. Part 11. - Electron Capture by Some Cyanocarbons and Related Compounds,
Trans. Farad. Soc., 1967, 63, 2369, https://doi.org/10.1039/tf9676302369
. [all data]