Benzenemethanol, α-methyl-, (R)-
- Formula: C8H10O
- Molecular weight: 122.1644
- IUPAC Standard InChIKey: WAPNOHKVXSQRPX-ZETCQYMHSA-N
- CAS Registry Number: 1517-69-7
- Chemical structure:
View 3d structure (requires JavaScript / HTML 5) - Stereoisomers:
- Other names: Benzenemethanol, α,-methyl-; Benzenemethanol, α-methyl-, (αR)-

Phase change data

Data compiled by: Robert L. Brown and Stephen E. Stein
Quantity | Value | Units | Method | Reference | Comment |
---|---|---|---|---|---|
Tboil | 476.2 | K | N/A | Weast and Grasselli, 1989 |
Reduced pressure boiling point
Tboil (K) | Pressure (bar) | Reference |
---|---|---|
371.2 | 0.027 | Aldrich Chemical Company Inc., 1990 |

References

Weast and Grasselli, 1989
CRC Handbook of Data on Organic Compounds, 2nd Editon, Weast,R.C and Grasselli, J.G., ed(s)., CRC Press, Inc., Boca Raton, FL, 1989, 1. [all data]
Aldrich Chemical Company Inc., 1990
Aldrich Chemical Company Inc.,
Catalog Handbook of Fine Chemicals, Aldrich Chemical Company, Inc., Milwaukee WI, 1990, 1. [all data]