d-methyl-tert-butylcarbinol
- Formula: C6H14O
- Molecular weight: 102.1748
- IUPAC Standard InChIKey: DFOXKPDFWGNLJU-RXMQYKEDSA-N
- CAS Registry Number: 1517-67-5
- Chemical structure:
View 3d structure (requires JavaScript / HTML 5) - Stereoisomers:

Phase change data

Data compiled by: Thermodynamics Research Center, NIST Boulder Laboratories, Chris Muzny director
Quantity | Value | Units | Method | Reference | Comment |
---|---|---|---|---|---|
Tboil | 393.2 | K | N/A | Stevens, 1933 | Uncertainty assigned by TRC = 2. K |
Tboil | 392.65 | K | N/A | Pickard and Kenyon, 1914 | Uncertainty assigned by TRC = 2. K |

References

Stevens, 1933
Stevens, P.G.,
The influence of branched chains on optical activity the configuration of methyl-tertiary-butylcarbinol,
J. Am. Chem. Soc., 1933, 55, 4237-40. [all data]
Pickard and Kenyon, 1914
Pickard, R.H.; Kenyon, J.,
Investigations on the dependence of rotatory power on chemical constitution: vi the optical rotatory power of methyl-tert-butyl-, methylbenzyl-, methylphenylethyl- and methyl-a-naphthyl-carbinols,
J. Chem. Soc., 1914, 105, 1115-31. [all data]