2-Butanol, 3-methyl-, (S)-
- Formula: C5H12O
- Molecular weight: 88.1482
- IUPAC Standard InChIKey: MXLMTQWGSQIYOW-RXMQYKEDSA-N
- CAS Registry Number: 1517-66-4
- Chemical structure:
View 3d structure (requires JavaScript / HTML 5) - Species with the same structure:
- Stereoisomers:
- Other names: (S)-(+)-3-Methyl-2-butanol

Phase change data

Data compiled by: Robert L. Brown and Stephen E. Stein
Reduced pressure boiling point
Tboil (K) | Pressure (bar) | Reference |
---|---|---|
385.2 | 0.979 | Weast and Grasselli, 1989 |

References

Weast and Grasselli, 1989
CRC Handbook of Data on Organic Compounds, 2nd Editon, Weast,R.C and Grasselli, J.G., ed(s)., CRC Press, Inc., Boca Raton, FL, 1989, 1. [all data]