2-Azidoethanol
- Formula: C2H5N3O
- Molecular weight: 87.0806
- CAS Registry Number: 1517-05-1

Condensed phase thermochemistry data

Data compiled by: Hussein Y. Afeefy, Joel F. Liebman, and Stephen E. Stein
Quantity | Value | Units | Method | Reference | Comment |
---|---|---|---|---|---|
ΔfH°liquid | 94.4 ± 1.9 | kJ/mol | Ccb | Fagley, Klein, et al., 1953 | Reanalyzed by Cox and Pilcher, 1970, Original value = 94.01 kJ/mol |
Quantity | Value | Units | Method | Reference | Comment |
ΔcH°liquid | -1596.0 ± 1.9 | kJ/mol | Ccb | Fagley, Klein, et al., 1953 | Reanalyzed by Cox and Pilcher, 1970, Original value = -1598.0 ± 1.6 kJ/mol |

Phase change data

Data compiled by: Robert L. Brown and Stephen E. Stein
Reduced pressure boiling point
Tboil (K) | Pressure (bar) | Reference |
---|---|---|
346. | 0.027 | Buckingham and Donaghy, 1982 |
333. | 0.01 | Buckingham and Donaghy, 1982 |

References

Fagley, Klein, et al., 1953
Fagley, T.F.; Klein, E.; Albrecht, J.F., Jr.,
The heats of combustion of diazoaminobenzene, benzotriazole and 2-triazoethanol,
J. Am. Chem. Soc., 1953, 75, 3104-31. [all data]
Cox and Pilcher, 1970
Cox, J.D.; Pilcher, G.,
Thermochemistry of Organic and Organometallic Compounds, Academic Press, New York, 1970, 1-636. [all data]
Buckingham and Donaghy, 1982
Buckingham, J.; Donaghy, S.M.,
Dictionary of Organic Compounds: Fifth Edition, Chapman and Hall, New York, 1982, 1. [all data]