Benzene, 1-azido-4-nitro-
- Formula: C6H4N4O2
- Molecular weight: 164.1216
- IUPAC Standard InChIKey: CZZVSJPFJBUBDK-UHFFFAOYSA-N
- CAS Registry Number: 1516-60-5
- Chemical structure:
View 3d structure (requires JavaScript / HTML 5) - Other names: p-Azidonitrobenzene; p-Nitrophenyl azide; 1-Azido-4-nitrobenzene; 4-Nitrophenyl azide; 1-Azido-4-nitrobenzen

Gas phase thermochemistry data

Data compiled by: Hussein Y. Afeefy, Joel F. Liebman, and Stephen E. Stein
Quantity | Value | Units | Method | Reference | Comment |
---|---|---|---|---|---|
ΔfH°gas | 389.7 ± 5.2 | kJ/mol | Ccb | Finch, Gardner, et al., 1997 |

Condensed phase thermochemistry data

Data compiled by: Hussein Y. Afeefy, Joel F. Liebman, and Stephen E. Stein
Quantity | Value | Units | Method | Reference | Comment |
---|---|---|---|---|---|
ΔfH°solid | 308.7 ± 4.3 | kJ/mol | Ccb | Finch, Gardner, et al., 1997 | |
Quantity | Value | Units | Method | Reference | Comment |
ΔcH°solid | -3241.4 ± 4.2 | kJ/mol | Ccb | Finch, Gardner, et al., 1997 |

Phase change data

Data compiled as indicated in comments:
ALS - Hussein Y. Afeefy, Joel F. Liebman, and Stephen E. Stein
AC - William E. Acree, Jr., James S. Chickos
Quantity | Value | Units | Method | Reference | Comment |
---|---|---|---|---|---|
ΔsubH° | 81. ± 3. | kJ/mol | E | Finch, Gardner, et al., 1997 | ALS |
Enthalpy of fusion
ΔfusH (kJ/mol) | Temperature (K) | Method | Reference | Comment |
---|---|---|---|---|
17.1 | 345.4 | DSC | Finch, Gardner, et al., 1997 | AC |

Reaction thermochemistry data

Data compiled by: Hussein Y. Afeefy, Joel F. Liebman, and Stephen E. Stein
Individual Reactions
+
= C16H16N4O2
By formula: C6H4N4O2 + C10H12 = C16H16N4O2
Quantity | Value | Units | Method | Reference | Comment |
---|---|---|---|---|---|
ΔrH° | -151. | kJ/mol | Cm | Samuilov, Movchan, et al., 1985 | solid phase; solvent: Chlorobenzene |
+
= C16H21O2
By formula: C10H17N + C6H4N4O2 = C16H21O2
Quantity | Value | Units | Method | Reference | Comment |
---|---|---|---|---|---|
ΔrH° | -99. | kJ/mol | Cm | Samuilov, Movchan, et al., 1985 | solid phase; solvent: Toluene |

References

Finch, Gardner, et al., 1997
Finch, A.; Gardner, P.J.; Head, A.J.; Xiaoping, W.,
The enthalpy of formation of 4-nitrophenyl azide,
Thermochim. Acta, 1997, 298, 191-194. [all data]
Samuilov, Movchan, et al., 1985
Samuilov, Ya.D.; Movchan, A.I.; Solov'eva, S.E.; Konovalov, A.I.,
Thermochemical and kinetic study of 1,3-dipolar cycloadditions involving aryl azides and nitrones,
Zh. Org. Khim., 1985, 21, 1772-1776. [all data]