[2H6]ethanol
- Formula: C2D6O
- Molecular weight: 52.1054
- IUPAC Standard InChIKey: LFQSCWFLJHTTHZ-LIDOUZCJSA-N
- CAS Registry Number: 1516-08-1
- Chemical structure:
View 3d structure (requires JavaScript / HTML 5) - Isotopologues:
- Other names: Ethanol-d6-

Reaction thermochemistry data

Data compiled by: John E. Bartmess
Individual Reactions
C2D5O- + =
By formula: C2D5O- + D+ = C2D6O
Quantity | Value | Units | Method | Reference | Comment |
---|---|---|---|---|---|
ΔrH° | 1583.7 ± 0.92 | kJ/mol | D-EA | Ramond, Davico, et al., 2000 | gas phase |
ΔrH° | 1584. ± 8.8 | kJ/mol | G+TS | Dang, Motell, et al., 1993 | gas phase |
ΔrH° | 1584. ± 8.4 | kJ/mol | CIDC | Haas and Harrison, 1993 | gas phase; Both metastable and 50 eV collision energy. |
Quantity | Value | Units | Method | Reference | Comment |
ΔrG° | 1553.7 ± 2.7 | kJ/mol | H-TS | Ramond, Davico, et al., 2000 | gas phase |
ΔrG° | 1554. ± 8.4 | kJ/mol | IMRE | Dang, Motell, et al., 1993 | gas phase |
ΔrG° | 1554. ± 8.8 | kJ/mol | H-TS | Haas and Harrison, 1993 | gas phase; Both metastable and 50 eV collision energy. |

References

Ramond, Davico, et al., 2000
Ramond, T.M.; Davico, G.E.; Schwartz, R.L.; Lineberger, W.C.,
Vibronic structure of alkoxy radicals via photoelectron spectroscopy,
J. Chem. Phys., 2000, 112, 3, 1158-1169, https://doi.org/10.1063/1.480767
. [all data]
Dang, Motell, et al., 1993
Dang, T.T.; Motell, E.L.; Travers, M.J.; Clifford, E.P.; Ellison, G.B.; Depuy, C.H.; Bierbaum, V.M.,
Experimental and Computational Studies of Deuterated Ethanols - Gas-Phase Acidities, Electron Affinities and Bond Dissociation Energies,
Int. J. Mass Spectrom. Ion Proc., 1993, 123, 3, 171, https://doi.org/10.1016/0168-1176(93)87096-B
. [all data]
Haas and Harrison, 1993
Haas, M.J.; Harrison, A.G.,
The Fragmentation of Proton-Bound Cluster Ions and the Gas-Phase Acidities of Alcohols,
Int. J. Mass Spectrom. Ion Proc., 1993, 124, 2, 115, https://doi.org/10.1016/0168-1176(93)80003-W
. [all data]