1,3-Butadien-1-ol, acetate
- Formula: C6H8O2
- Molecular weight: 112.1265
- IUPAC Standard InChIKey: NMQQBXHZBNUXGJ-SNAWJCMRSA-N
- CAS Registry Number: 1515-76-0
- Chemical structure:
View 3d structure (requires JavaScript / HTML 5) - Other names: 1-Acetoxy-1,3-butadiene; Butadienyl acetate; 1-Acetoxybutadiene; 1,3-Butadienyl acetate; Acetic acid, 1,3-butadienyl ester; 1,3-Butadienylester kyseliny octove

Phase change data

Data compiled as indicated in comments:
BS - Robert L. Brown and Stephen E. Stein
TRC - Thermodynamics Research Center, NIST Boulder Laboratories, Chris Muzny director
Quantity | Value | Units | Method | Reference | Comment |
---|---|---|---|---|---|
Tfus | 229.1 | K | N/A | Anonymous, 1954 | Uncertainty assigned by TRC = 0.6 K; TRC |
Reduced pressure boiling point
Tboil (K) | Pressure (bar) | Reference | Comment |
---|---|---|---|
333.7 | 0.053 | Weast and Grasselli, 1989 | BS |

References

Anonymous, 1954
Anonymous, R.,
, Am. Pet. Inst. Res. Proj. 45, Tech. Rep. 13, Ohio State Univ., 1954. [all data]
Weast and Grasselli, 1989
CRC Handbook of Data on Organic Compounds, 2nd Editon, Weast,R.C and Grasselli, J.G., ed(s)., CRC Press, Inc., Boca Raton, FL, 1989, 1. [all data]