1,1,1,3,3,3-hexafluoro-2-methylpropan-2-ol
- Formula: C4H4F6O
- Molecular weight: 182.0644
- CAS Registry Number: 1515-14-6

Reaction thermochemistry data

Data compiled as indicated in comments:
B - John E. Bartmess
M - Michael M. Meot-Ner (Mautner) and Sharon G. Lias
Individual Reactions
By formula: F- + C4H4F6O = (F- • C4H4F6O)
Quantity | Value | Units | Method | Reference | Comment |
---|---|---|---|---|---|
ΔrH° | 46.0 ± 2.0 | kcal/mol | IMRE | Larson and McMahon, 1983 | gas phase; These relative affinities are ca. 10 kcal/mol weaker than threshold values (see Wenthold and Squires, 1995) for donors greater than ca. 27 kcal/mol in free energy. This discrepancy has not yet been resolved, though the stronger value appears preferable.; B |
Quantity | Value | Units | Method | Reference | Comment |
ΔrG° | 37.9 ± 2.0 | kcal/mol | IMRE | Larson and McMahon, 1983 | gas phase; These relative affinities are ca. 10 kcal/mol weaker than threshold values (see Wenthold and Squires, 1995) for donors greater than ca. 27 kcal/mol in free energy. This discrepancy has not yet been resolved, though the stronger value appears preferable.; B |
By formula: Cl- + C4H4F6O = (Cl- • C4H4F6O)
Quantity | Value | Units | Method | Reference | Comment |
---|---|---|---|---|---|
ΔrH° | 26.5 | kcal/mol | ICR | Larson and McMahon, 1984 | gas phase; switching reaction(Cl-)HCOOH, Entropy change calculated or estimated, DG>, ΔrH>; Larson and McMahon, 1984, 2; M |
Quantity | Value | Units | Method | Reference | Comment |
ΔrS° | 25.0 | cal/mol*K | N/A | Larson and McMahon, 1984 | gas phase; switching reaction(Cl-)HCOOH, Entropy change calculated or estimated, DG>, ΔrH>; Larson and McMahon, 1984, 2; M |
Quantity | Value | Units | Method | Reference | Comment |
ΔrG° | 19.0 | kcal/mol | ICR | Larson and McMahon, 1984 | gas phase; switching reaction(Cl-)HCOOH, Entropy change calculated or estimated, DG>, ΔrH>; Larson and McMahon, 1984, 2; M |
CN- + C4H4F6O = (CN- • C4H4F6O)
By formula: CN- + C4H4F6O = (CN- • C4H4F6O)
Quantity | Value | Units | Method | Reference | Comment |
---|---|---|---|---|---|
ΔrH° | 25.7 ± 3.5 | kcal/mol | IMRE | Larson and McMahon, 1987 | gas phase; B,M,M |
Quantity | Value | Units | Method | Reference | Comment |
ΔrS° | 26.4 | cal/mol*K | N/A | Larson and McMahon, 1987 | gas phase; switching reaction,Thermochemical ladder(CN-)H2O, Entropy change calculated or estimated; Payzant, Yamdagni, et al., 1971; M |
ΔrS° | 26.4 | cal/mol*K | N/A | Larson and McMahon, 1987 | gas phase; switching reaction,Thermochemical ladder(CN-)H2O, Entropy change calculated or estimated; Payzant, Yamdagni, et al., 1971; M |
Quantity | Value | Units | Method | Reference | Comment |
ΔrG° | 17.8 ± 2.3 | kcal/mol | IMRE | Larson and McMahon, 1987 | gas phase; B,M,M |
C4H3F6O- + = C4H4F6O
By formula: C4H3F6O- + H+ = C4H4F6O
Quantity | Value | Units | Method | Reference | Comment |
---|---|---|---|---|---|
ΔrH° | 348.2 ± 2.1 | kcal/mol | G+TS | Caldwell, McMahon, et al., 1985 | gas phase; value altered from reference due to change in acidity scale; B |
Quantity | Value | Units | Method | Reference | Comment |
ΔrG° | 340.6 ± 2.0 | kcal/mol | IMRE | Caldwell, McMahon, et al., 1985 | gas phase; value altered from reference due to change in acidity scale; B |

Gas phase ion energetics data

Data evaluated as indicated in comments:
HL - Edward P. Hunter and Sharon G. Lias
Data compiled as indicated in comments:
B - John E. Bartmess
Quantity | Value | Units | Method | Reference | Comment |
---|---|---|---|---|---|
Proton affinity (review) | 165.2 | kcal/mol | N/A | Hunter and Lias, 1998 | HL |
Quantity | Value | Units | Method | Reference | Comment |
Gas basicity | 158.0 | kcal/mol | N/A | Hunter and Lias, 1998 | HL |
De-protonation reactions
C4H3F6O- + = C4H4F6O
By formula: C4H3F6O- + H+ = C4H4F6O
Quantity | Value | Units | Method | Reference | Comment |
---|---|---|---|---|---|
ΔrH° | 348.2 ± 2.1 | kcal/mol | G+TS | Caldwell, McMahon, et al., 1985 | gas phase; value altered from reference due to change in acidity scale; B |
Quantity | Value | Units | Method | Reference | Comment |
ΔrG° | 340.6 ± 2.0 | kcal/mol | IMRE | Caldwell, McMahon, et al., 1985 | gas phase; value altered from reference due to change in acidity scale; B |

Ion clustering data

Data compiled as indicated in comments:
B - John E. Bartmess
M - Michael M. Meot-Ner (Mautner) and Sharon G. Lias
Clustering reactions
CN- + C4H4F6O = (CN- • C4H4F6O)
By formula: CN- + C4H4F6O = (CN- • C4H4F6O)
Quantity | Value | Units | Method | Reference | Comment |
---|---|---|---|---|---|
ΔrH° | 25.7 ± 3.5 | kcal/mol | IMRE | Larson and McMahon, 1987 | gas phase; B,M,M |
Quantity | Value | Units | Method | Reference | Comment |
ΔrS° | 26.4 | cal/mol*K | N/A | Larson and McMahon, 1987 | gas phase; switching reaction,Thermochemical ladder(CN-)H2O, Entropy change calculated or estimated; Payzant, Yamdagni, et al., 1971; M |
ΔrS° | 26.4 | cal/mol*K | N/A | Larson and McMahon, 1987 | gas phase; switching reaction,Thermochemical ladder(CN-)H2O, Entropy change calculated or estimated; Payzant, Yamdagni, et al., 1971; M |
Quantity | Value | Units | Method | Reference | Comment |
ΔrG° | 17.8 ± 2.3 | kcal/mol | IMRE | Larson and McMahon, 1987 | gas phase; B,M,M |
By formula: Cl- + C4H4F6O = (Cl- • C4H4F6O)
Quantity | Value | Units | Method | Reference | Comment |
---|---|---|---|---|---|
ΔrH° | 26.5 | kcal/mol | ICR | Larson and McMahon, 1984 | gas phase; switching reaction(Cl-)HCOOH, Entropy change calculated or estimated, DG>, ΔrH>; Larson and McMahon, 1984, 2; M |
Quantity | Value | Units | Method | Reference | Comment |
ΔrS° | 25.0 | cal/mol*K | N/A | Larson and McMahon, 1984 | gas phase; switching reaction(Cl-)HCOOH, Entropy change calculated or estimated, DG>, ΔrH>; Larson and McMahon, 1984, 2; M |
Quantity | Value | Units | Method | Reference | Comment |
ΔrG° | 19.0 | kcal/mol | ICR | Larson and McMahon, 1984 | gas phase; switching reaction(Cl-)HCOOH, Entropy change calculated or estimated, DG>, ΔrH>; Larson and McMahon, 1984, 2; M |
By formula: F- + C4H4F6O = (F- • C4H4F6O)
Quantity | Value | Units | Method | Reference | Comment |
---|---|---|---|---|---|
ΔrH° | 46.0 ± 2.0 | kcal/mol | IMRE | Larson and McMahon, 1983 | gas phase; These relative affinities are ca. 10 kcal/mol weaker than threshold values (see Wenthold and Squires, 1995) for donors greater than ca. 27 kcal/mol in free energy. This discrepancy has not yet been resolved, though the stronger value appears preferable.; B |
Quantity | Value | Units | Method | Reference | Comment |
ΔrG° | 37.9 ± 2.0 | kcal/mol | IMRE | Larson and McMahon, 1983 | gas phase; These relative affinities are ca. 10 kcal/mol weaker than threshold values (see Wenthold and Squires, 1995) for donors greater than ca. 27 kcal/mol in free energy. This discrepancy has not yet been resolved, though the stronger value appears preferable.; B |

Phase change data

Data compiled by: Robert L. Brown and Stephen E. Stein
Quantity | Value | Units | Method | Reference | Comment |
---|---|---|---|---|---|
Tboil | 333. | K | N/A | PCR Inc., 1990 |

References

Larson and McMahon, 1983
Larson, J.W.; McMahon, T.B.,
Strong hydrogen bonding in gas-phase anions. An ion cyclotron resonance determination of fluoride binding energetics to bronsted acids from gas-phase fluoride exchange equilibria measurements,
J. Am. Chem. Soc., 1983, 105, 2944. [all data]
Wenthold and Squires, 1995
Wenthold, P.G.; Squires, R.R.,
Bond dissociation energies of F2(-) and HF2(-). A gas-phase experimental and G2 theoretical study,
J. Phys. Chem., 1995, 99, 7, 2002, https://doi.org/10.1021/j100007a034
. [all data]
Larson and McMahon, 1984
Larson, J.W.; McMahon, T.B.,
Hydrogen bonding in gas phase anions. An experimental investigation of the interaction between chloride ion and bronsted acids from ICR chloride exchange equilibria,
J. Am. Chem. Soc., 1984, 106, 517. [all data]
Larson and McMahon, 1984, 2
Larson, J.W.; McMahon, T.B.,
Gas phase negative ion chemistry of alkylchloroformates,
Can. J. Chem., 1984, 62, 675. [all data]
Larson and McMahon, 1987
Larson, J.W.; McMahon, T.B.,
Hydrogen bonding in gas phase anions. The energetics of interaction between cyanide ion and bronsted acids,
J. Am. Chem. Soc., 1987, 109, 6230. [all data]
Payzant, Yamdagni, et al., 1971
Payzant, J.D.; Yamdagni, R.; Kebarle, P.,
Hydration of CN-, NO2-, NO3-, and HO- in the gas phase,
Can. J. Chem., 1971, 49, 3308. [all data]
Caldwell, McMahon, et al., 1985
Caldwell, G.; McMahon, T.B.; Kebarle, P.; Bartmess, J.E.; Kiplinger, J.P.,
Methyl substituent effects in the gas phase acidities of halosubstituted oxygen acids. A realignment with substituent effects in solution,
J. Am. Chem. Soc., 1985, 107, 80. [all data]
Hunter and Lias, 1998
Hunter, E.P.; Lias, S.G.,
Evaluated Gas Phase Basicities and Proton Affinities of Molecules: An Update,
J. Phys. Chem. Ref. Data, 1998, 27, 3, 413-656, https://doi.org/10.1063/1.556018
. [all data]