1-Chloro-2-isopropyl-4-methylbenzene
- Formula: C10H13Cl
- Molecular weight: 168.663
- IUPAC Standard InChIKey: ZYHNYYRQDNMFBW-UHFFFAOYSA-N
- CAS Registry Number: 15146-00-6
- Chemical structure:
View 3d structure (requires JavaScript / HTML 5) - Permanent link for this species. Use this link for bookmarking this species for future reference.

Condensed phase thermochemistry data

Data compiled by: Hussein Y. Afeefy, Joel F. Liebman, and Stephen E. Stein
Quantity | Value | Units | Method | Reference | Comment |
---|---|---|---|---|---|
ΔfH°liquid | -111.6 ± 2.2 | kJ/mol | Eqk | Nesterova, Rozhnov, et al., 1985 |

Phase change data

Data compiled by: William E. Acree, Jr., James S. Chickos
Enthalpy of vaporization
ΔvapH (kJ/mol) | Temperature (K) | Method | Reference | Comment |
---|---|---|---|---|
47.1 | 415. | A | Stephenson and Malanowski, 1987 | Based on data from 400. to 490. K. See also Dykyj and Vanko, 1970. |

Reaction thermochemistry data

Data compiled by: Hussein Y. Afeefy, Joel F. Liebman, and Stephen E. Stein
Individual Reactions
By formula: C7H7Cl + C13H19Cl = C10H13Cl + C10H13Cl
Quantity | Value | Units | Method | Reference | Comment |
---|---|---|---|---|---|
ΔrH° | -0.72 ± 0.50 | kJ/mol | Eqk | Nesterova, Rozhnov, et al., 1985 | liquid phase |
By formula: C10H13Cl = C10H13Cl
Quantity | Value | Units | Method | Reference | Comment |
---|---|---|---|---|---|
ΔrH° | -3.1 ± 1.1 | kJ/mol | Eqk | Nesterova, Rozhnov, et al., 1985 | liquid phase |

References

Nesterova, Rozhnov, et al., 1985
Nesterova, T.N.; Rozhnov, A.M.; Malova, T.N.; Kovzel, E.N.,
Molar enthalpies of formation of isopropylchlorobenzenes derived from equilibrium measurements,
J. Chem. Thermodyn., 1985, 17, 649-656. [all data]
Stephenson and Malanowski, 1987
Stephenson, Richard M.; Malanowski, Stanislaw,
Handbook of the Thermodynamics of Organic Compounds, 1987, https://doi.org/10.1007/978-94-009-3173-2
. [all data]
Dykyj and Vanko, 1970
Dykyj, J.; Vanko, A.,
Petrochemica, 1970, 10, 1, 3. [all data]