Cyclopentene, 3,3'-oxybis-
- Formula: C10H14O
- Molecular weight: 150.2176
- IUPAC Standard InChIKey: JHXDCKWLPYBHJY-UHFFFAOYSA-N
- CAS Registry Number: 15131-55-2
- Chemical structure:
View 3d structure (requires JavaScript / HTML 5) - Other names: 2-Cyclopenten-1-yl ether; Ether, bis(2-cyclopentenyl); Bis(cyclopent-2-enyl) ether

Phase change data

Data compiled as indicated in comments:
BS - Robert L. Brown and Stephen E. Stein
TRC - Thermodynamics Research Center, NIST Boulder Laboratories, Chris Muzny director
Quantity | Value | Units | Method | Reference | Comment |
---|---|---|---|---|---|
Tfus | 199.6 | K | N/A | Anonymous, 1955 | Uncertainty assigned by TRC = 0.6 K; TRC |
Reduced pressure boiling point
Tboil (K) | Pressure (bar) | Reference | Comment |
---|---|---|---|
360.2 | 0.016 | Aldrich Chemical Company Inc., 1990 | BS |

References

Anonymous, 1955
Anonymous, R.,
, Am. Pet. Inst. Res. Proj. 45, Tech. Rep. 14, No. 1, Ohio State Univ., 1955. [all data]
Aldrich Chemical Company Inc., 1990
Aldrich Chemical Company Inc.,
Catalog Handbook of Fine Chemicals, Aldrich Chemical Company, Inc., Milwaukee WI, 1990, 1. [all data]