3-Octanol, 3,6-dimethyl-
- Formula: C10H22O
- Molecular weight: 158.2811
- IUPAC Standard InChIKey: NPHCXUPGMINOPP-UHFFFAOYSA-N
- CAS Registry Number: 151-19-9
- Chemical structure:
View 3d structure (requires JavaScript / HTML 5) - Other names: AR 1; 3,6-Dimethyl-3-Octanol; 3,6-dimethyloctan-3-ol

Normal alkane RI, polar column, temperature ramp

Column type | Active phase | I | Reference | Comment |
---|---|---|---|---|
Capillary | DB-Wax | 1990. | Souza, Re-Poppi, et al., 2012 | 30. m/0.25 mm/0.25 μm, Helium, 60. C @ 1. min, 5. K/min; Tend: 240. C |

References

Souza, Re-Poppi, et al., 2012
Souza, J.B.G.; Re-Poppi, N.; Raposo, J.L.(Jr).,
Characterization of pyroligneous acid used in agriculture by gas chromatography - mass spectrometry (in press),
J. Braz. Chem. Soc., 2012, 00, 00, 1-8. [all data]