3-Aminopropionitrile
- Formula: C3H6N2
- Molecular weight: 70.0931
- IUPAC Standard InChIKey: AGSPXMVUFBBBMO-UHFFFAOYSA-N
- CAS Registry Number: 151-18-8
- Chemical structure:
View 3d structure (requires JavaScript / HTML 5) - Other names: 3-Aminopropanenitrile; H2NCH2CH2CN; β-Aminoethyl cyanide; β-Aminopropionitrile; Propanenitrile, 3-amino-; β-Alaninenitrile; β-Cyanoethylamine; Aminopropionitrile; BAPN; Propionitrile, 3-amino-; 2-Cyanoethylamine; NSC 40641; 3-aminopropiononitrile

Gas phase thermochemistry data

Data compiled by: Hussein Y. Afeefy, Joel F. Liebman, and Stephen E. Stein
Quantity | Value | Units | Method | Reference | Comment |
---|---|---|---|---|---|
ΔfH°gas | 89.75 | kJ/mol | Eqk | Mekhtiev, Safarov, et al., 1985 |

Phase change data

Data compiled by: Robert L. Brown and Stephen E. Stein
Reduced pressure boiling point
Tboil (K) | Pressure (bar) | Reference |
---|---|---|
352. to 354. | 0.021 | Frinton Laboratories Inc., 1986 |

Gas phase ion energetics data

Data evaluated by: Edward P. Hunter and Sharon G. Lias
Quantity | Value | Units | Method | Reference | Comment |
---|---|---|---|---|---|
Proton affinity (review) | 866.4 | kJ/mol | N/A | Hunter and Lias, 1998 | |
Quantity | Value | Units | Method | Reference | Comment |
Gas basicity | 832.5 | kJ/mol | N/A | Hunter and Lias, 1998 |

Normal alkane RI, non-polar column, custom temperature program

Column type | Active phase | I | Reference | Comment |
---|---|---|---|---|
Capillary | Methyl Silicone | 789. | Zenkevich, 1996 | Program: not specified |

References

Mekhtiev, Safarov, et al., 1985
Mekhtiev, S.I.; Safarov, Yu.D.; Aliev, A.N.; Rasulbekova, T.I.,
Thermodynamics of cyanoethylation of ammonia,
Azerb. Khim. Zh., 1985, 27-32. [all data]
Frinton Laboratories Inc., 1986
Frinton Laboratories Inc.,
Catalog Number 11, Frinton Laboratories Inc., Vineland, NJ, 1986, 99. [all data]
Hunter and Lias, 1998
Hunter, E.P.; Lias, S.G.,
Evaluated Gas Phase Basicities and Proton Affinities of Molecules: An Update,
J. Phys. Chem. Ref. Data, 1998, 27, 3, 413-656, https://doi.org/10.1063/1.556018
. [all data]
Zenkevich, 1996
Zenkevich, I.G.,
Informational Maitenance of Gas Chromatographic Identification of Organic Compounds in Ecoanalytical Investigations,
Z. Anal. Chem., 1996, 51, 11, 1140-1148. [all data]