dodecane-1-sulphonic acid

Condensed phase thermochemistry data

Data compiled by: Hussein Y. Afeefy, Joel F. Liebman, and Stephen E. Stein

Quantity Value Units Method Reference Comment
Δcsolid-7816. ± 15.kJ/molCcbRoth and Rist-Schumacher, 1944At 292 °K

Reaction thermochemistry data

Data compiled by: Hussein Y. Afeefy, Joel F. Liebman, and Stephen E. Stein

Individual Reactions

1-Dodecanesulfonyl chloride + Water = C12H26O3S + Hydrogen chloride

By formula: C12H25ClO2S + H2O = C12H26O3S + HCl

Quantity Value Units Method Reference Comment
Δr-0.3 ± 2.0kcal/molCmRoth and Rist-Schumacher, 1944solid phase

Dodecane + Sulfuric Acid = C12H26O3S + Water

By formula: C12H26 + H2O4S = C12H26O3S + H2O

Quantity Value Units Method Reference Comment
Δr69.3 ± 4.0kcal/molCmRoth and Rist-Schumacher, 1944liquid phase

References

Roth and Rist-Schumacher, 1944
Roth, W.A.; Rist-Schumacher, E., Beitrag zur thermochemie der sulfonsauren und saurechlorid, Z. Electrochem., 1944, 50, 7-9. [all data]