(E)-3-Ethylidenecyclohexene
- Formula: C8H12
- Molecular weight: 108.1809
- IUPAC Standard InChIKey: HCKKIWXIMBMLCD-WAPJZHGLSA-N
- CAS Registry Number: 15094-06-1
- Chemical structure:
View 3d structure (requires JavaScript / HTML 5) - Species with the same structure:
- Stereoisomers:

Reaction thermochemistry data

Data compiled by: Hussein Y. Afeefy, Joel F. Liebman, and Stephen E. Stein
Individual Reactions
By formula: C8H12 = C8H12
Quantity | Value | Units | Method | Reference | Comment |
---|---|---|---|---|---|
ΔrH° | 2. ± 2. | kJ/mol | Kin | Doering, Roth, et al., 1991 | gas phase; At 666 K |

References

Doering, Roth, et al., 1991
Doering, W.E.; Roth, W.R.; Bauer, F.; Boenke, M.; Breuckmann, R.; Ruhkamp, J.; Wortmann, O.,
Rotationsbarrieren Vinyl-substituierter Olefine,
Chem. Ber., 1991, 124, 1461-1470. [all data]