Cyclohexene, 3-ethylidene-, (Z)-
- Formula: C8H12
- Molecular weight: 108.1809
- IUPAC Standard InChIKey: HCKKIWXIMBMLCD-KRXBUXKQSA-N
- CAS Registry Number: 15094-05-0
- Chemical structure:
View 3d structure (requires JavaScript / HTML 5) - Stereoisomers:

Reaction thermochemistry data

Data compiled by: Hussein Y. Afeefy, Joel F. Liebman, and Stephen E. Stein
Individual Reactions
By formula: C8H12 = C8H12
Quantity | Value | Units | Method | Reference | Comment |
---|---|---|---|---|---|
ΔrH° | 2.0 ± 0.4 | kJ/mol | Eqk | Taskinen and Nummelin, 1994 | liquid phase; solvent: Dimethylsulfoxide |
By formula: C8H12 = C8H12
Quantity | Value | Units | Method | Reference | Comment |
---|---|---|---|---|---|
ΔrH° | 2. ± 2. | kJ/mol | Kin | Doering, Roth, et al., 1991 | gas phase; At 666 K |

References

Taskinen and Nummelin, 1994
Taskinen, E.; Nummelin, K.,
Relative thermodynamic stabilities of 3-ethylidenecyclohexenes and isomeric ethylcyclohexadienes,
Tetrahedron, 1994, 50, 11693-11698. [all data]
Doering, Roth, et al., 1991
Doering, W.E.; Roth, W.R.; Bauer, F.; Boenke, M.; Breuckmann, R.; Ruhkamp, J.; Wortmann, O.,
Rotationsbarrieren Vinyl-substituierter Olefine,
Chem. Ber., 1991, 124, 1461-1470. [all data]