6-Octen-1-ol, 3,7-dimethyl-, acetate
- Formula: C12H22O2
- Molecular weight: 198.3019
- IUPAC Standard InChIKey: JOZKFWLRHCDGJA-UHFFFAOYSA-N
- CAS Registry Number: 150-84-5
- Chemical structure:
View 3d structure (requires JavaScript / HTML 5) - Other names: Citronellol acetate; Citronellyl acetate; Natural rhodinol, acetylated; 3,7-Dimethyl-6-octenyl acetate; β-Citronellyl acetate; Acetic acid, citronellyl ester; Acetic acid, 3,7-dimethyl-6-octen-1-yl ester; 1-Acetoxy-3,7-dimethyloct-6-ene; 2-Octen-8-ol, 2,6-dimethyl-, acetate; 3,7-Dimethyl-6-octen-1-yl acetate; Cephreine; β-Citronellol, acetate; CitronellyI acetate; 6-Octen-1-ol, 3,7-dimethyl-, 1-acetate; NSC 4893; Cytronellyl acetate; Acetic acid, rhodinyl ester

Phase change data

Data compiled as indicated in comments:
AC - William E. Acree, Jr., James S. Chickos
Enthalpy of vaporization
ΔvapH (kJ/mol) | Temperature (K) | Method | Reference | Comment |
---|---|---|---|---|
68.7 | 362. | A | Stephenson and Malanowski, 1987 | Based on data from 347. to 490. K. See also Stull, 1947.; AC |
Antoine Equation Parameters
log10(P) = A − (B / (T + C))
P = vapor pressure (bar)
T = temperature (K)
View plot Requires a JavaScript / HTML 5 canvas capable browser.
Temperature (K) | A | B | C | Reference | Comment |
---|---|---|---|---|---|
347.8 to 490. | 6.30484 | 2855.761 | -36.775 | Stull, 1947 | Coefficents calculated by NIST from author's data. |

Normal alkane RI, polar column, temperature ramp

Data compiled by: NIST Mass Spectrometry Data Center, William E. Wallace, director

Column type CapillaryCapillaryCapillaryCapillaryCapillary
Active phase InnowaxCarbowaxCarbowaxBP-20DB-Wax
Column length (m) 30.60.60.50.60.
Carrier gas HeliumHeHe He
Substrate
Column diameter (mm) 0.250.20.20.220.25
Phase thickness (μm) 0.250.250.250.250.25
Tstart (C) 40.60.60.60.70.
Tend (C) 250.250.250.220.230.
Heat rate (K/min) 6.2.2.2.2.
Initial hold (min) 1.8.8. 2.
Final hold (min) 4.15.15.20.20.
I 1668.1645.1633.1659.1666.
ReferenceSeo, Kim, et al., 2009Ferhat, Meklati, et al., 2007Ferhat, Tigrine-Kordjani, et al., 2007Boti, Yao, et al., 2006Choi H.S., 2006
Comment MSDC-RI MSDC-RI MSDC-RI MSDC-RI MSDC-RI
Column type CapillaryCapillaryCapillaryCapillaryCapillary
Active phase DB-WaxDB-WaxCarbowax 20MStabilwaxPE-Wax
Column length (m) 60.60.60.30.50.
Carrier gas   N2 H2
Substrate
Column diameter (mm) 0.250.250.250.320.32
Phase thickness (μm) 0.250.250.250.50.25
Tstart (C) 70.70.40.40.60.
Tend (C) 230.230.190.280.220.
Heat rate (K/min) 2.2.10.6.4.
Initial hold (min) 2.2.2.5.
Final hold (min) 20.20.15.5.2.
I 1660.1662.1645.1643.1655.
ReferenceLan Phi N.T., Nishiyama C., et al., 2006Sawamura, Onishi, et al., 2006Babu and Kaul, 2005Jirovetz, Buchbauer, et al., 2005Ram, Kumar, et al., 2005
Comment MSDC-RI MSDC-RI MSDC-RI MSDC-RI MSDC-RI
Column type CapillaryCapillaryCapillaryCapillaryCapillary
Active phase DB-WaxDB-WaxDB-WaxDB-WaxDB-Wax
Column length (m) 60.60.60.60.60.
Carrier gas N2N2HeHeHe
Substrate
Column diameter (mm) 0.250.250.250.250.25
Phase thickness (μm) 0.250.25  0.25
Tstart (C) 70.70.60.60.40.
Tend (C) 230.230.220.220.220.
Heat rate (K/min) 2.2.2.2.3.
Initial hold (min) 2.2.4.4.5.
Final hold (min) 20.20.
I 1669.1669.1658.1658.1660.
ReferenceChoi, 2004Choi, 2004, 2Jiang and Kubota, 2004Jiang and Kubota, 2004López, Ezpeleta, et al., 2004
Comment MSDC-RI MSDC-RI MSDC-RI MSDC-RI MSDC-RI
Column type CapillaryCapillaryCapillaryCapillaryCapillary
Active phase PEG-20MNB-20MDB-WaxDB-WaxDB-Wax
Column length (m) 50.50.60.60.60.
Carrier gas  He NitrogenHelium
Substrate
Column diameter (mm) 0.200.20.250.250.25
Phase thickness (μm) 0.200.250.250.25
Tstart (C) 40.50.70.70.70.
Tend (C) 180.250.230.230.210.
Heat rate (K/min) 3.2.2.2.2.
Initial hold (min) 5. 2.2.
Final hold (min) 30. 20. 60.
I 1645.1670.1665.1665.1654.
ReferenceNarain, Almeida, et al., 2004Raal, Arak, et al., 2004Sawamura, Son, et al., 2004Sawamura, Sou, et al., 2004Mookdasanit, Tamura, et al., 2003
Comment MSDC-RI MSDC-RI MSDC-RI MSDC-RI MSDC-RI
Column type CapillaryCapillaryCapillaryCapillaryCapillary
Active phase DB-WaxDB-WaxSupelcowax-10DB-WaxDB-Wax
Column length (m) 60.60.60.60.60.
Carrier gas N2H2HeN2N2
Substrate
Column diameter (mm) 0.250.320.20.250.25
Phase thickness (μm) 0.250.250.50.250.25
Tstart (C) 70.40.70.70.70.
Tend (C) 230.245.220.230.230.
Heat rate (K/min) 2.1.52.2.2.
Initial hold (min) 2.  2.
Final hold (min) 20.20. 20.
I 1634.1655.1671.1652.1665.
ReferenceTu, Onishi, et al., 2003Gancel, Ollé, et al., 2002Orav, Kailas, et al., 2002Tu, Onishi, et al., 2002Tu, Thanh, et al., 2002
Comment MSDC-RI MSDC-RI MSDC-RI MSDC-RI MSDC-RI
Column type CapillaryCapillaryCapillaryCapillaryCapillary
Active phase DB-WaxDB-WaxDB-WaxBP-20Supelcowax-10
Column length (m) 60.60.60.50.30.
Carrier gas HeHeHeHeHe
Substrate
Column diameter (mm) 0.250.250.250.220.32
Phase thickness (μm) 0.250.25 0.250.25
Tstart (C) 40.45.40.60.70.
Tend (C) 200.240.220.230.240.
Heat rate (K/min) 2.3.2.2.5.
Initial hold (min) 2.   8.
Final hold (min)    35.20.
I 1649.1665.1660.1654.1616.
ReferenceUmano, Hagi, et al., 2002Christoph, 2001Jiang and Kubota, 2001Lota, de Rocca Serra, et al., 2001Kim, Kim, et al., 2000
Comment MSDC-RI MSDC-RI MSDC-RI MSDC-RI MSDC-RI
Column type CapillaryCapillaryCapillaryCapillaryCapillary
Active phase DB-WaxSupelcowax-10BP-20Supelcowax-10DB-Wax
Column length (m) 60.30.25.30.30.
Carrier gas Nitrogen  HeN2
Substrate
Column diameter (mm) 0.250.250.330.250.25
Phase thickness (μm)  0.250.5 0.25
Tstart (C) 40.60.80.60.45.
Tend (C) 200.220.220.240.220.
Heat rate (K/min) 2.4.5.4.3.
Initial hold (min) 10.
Final hold (min)
I 1649.1667.1671.1662.1669.
ReferenceTamura, Boonbumrung, et al., 2000Choo, Wong, et al., 1999Dunlop, Bignell, et al., 1999Lamarque, Maestri, et al., 1998Mölleken, Sinnwell, et al., 1998
Comment MSDC-RI MSDC-RI MSDC-RI MSDC-RI MSDC-RI
Column type CapillaryCapillaryCapillaryCapillaryCapillary
Active phase DB-WaxPEG-20MCarbowax 20MCarbowax 20MCarbowax 20M
Column length (m) 60.60.60.100.100.
Carrier gas H2HeHe
Substrate
Column diameter (mm) 0.320.250.250.250.25
Phase thickness (μm) 0.25 0.25
Tstart (C) 60.70.50.70.70.
Tend (C) 220.210.150.170.170.
Heat rate (K/min) 3.3.2.1.1.
Initial hold (min)   10.
Final hold (min)   20.
I 1672.1671.1645.1656.1658.
ReferenceWerkhoff, Güntert, et al., 1998Awano, Honda, et al., 1997Tirado, Stashenko, et al., 1995Shibamoto and Jennings, 1977Shibamoto and Jennings, 1977
Comment MSDC-RI MSDC-RI MSDC-RI MSDC-RI MSDC-RI

Kovats' RI, non-polar column, temperature ramp

Data compiled by: NIST Mass Spectrometry Data Center, William E. Wallace, director

Column type CapillaryCapillaryCapillaryCapillaryCapillary
Active phase DB-1HP-5MSHP-5HP-5MSBP-5
Column length (m) 30.60.25.30.50.
Carrier gas HeHe HeHe
Substrate
Column diameter (mm) 0.250.250.20.250.32
Phase thickness (μm) 0.250.250.330.250.25
Tstart (C) 50.40.60.50.50.
Tend (C) 280.250.240.250.260.
Heat rate (K/min) 5.3.3.3.5.
Initial hold (min) 3.1. 10.2.
Final hold (min)  20. 5.5.
I 1336.1354.1357.1356.1354.
ReferenceAllegrone, Belliardo, et al., 2006Jalali-Heravi, Zekavat, et al., 2006Oliveira, Leitao, et al., 2006Asuming, Beauchamp, et al., 2005Baranauskiene, Venskutonis, et al., 2005
Comment MSDC-RI MSDC-RI MSDC-RI MSDC-RI MSDC-RI
Column type CapillaryCapillaryCapillaryCapillaryCapillary
Active phase SPB-5CP Sil 5 CBDB-5BP-1DB-5
Column length (m) 60.25.50.25.60.
Carrier gas HeH2HeN2He
Substrate
Column diameter (mm) 0.320.250.320.550.32
Phase thickness (μm) 1.0.150.250.251.
Tstart (C) 60.50.50.60.40.
Tend (C) 200.230.280.220.230.
Heat rate (K/min) 4.3.5.5.3.
Initial hold (min)   2. 5.
Final hold (min) 30. 10.15.2.
I 1347.1337.1357.1341.1376.
ReferenceGauvin, Lecomte, et al., 2004Ogunwande, Olawore, et al., 2004Baranauskiene, Venskutonis, et al., 2003Srivastava, Ahmad, et al., 2003Buchin, Salmon, et al., 2002
Comment MSDC-RI MSDC-RI MSDC-RI MSDC-RI MSDC-RI
Column type CapillaryCapillaryCapillaryCapillaryCapillary
Active phase Methyl SiliconeCross-Linked MethylsiliconeBP-1SE-54DB-5
Column length (m) 50.50.25.30.30.
Carrier gas HeHeN2HeHe
Substrate
Column diameter (mm) 0.250.20.550.260.26
Phase thickness (μm) 0.250.250.250.250.25
Tstart (C) 70.100.60.60.60.
Tend (C) 240.280.220.246.240.
Heat rate (K/min) 4.4.5.3.3.
Initial hold (min)
Final hold (min)   15.
I 1347.1338.1333.1354.1354.
ReferencePalá-Paúl, Pérez-Alonso, et al., 2002Rajeswara Rao, Kaul, et al., 2002Jain, Aggarwal, et al., 2001Adams, 2000Adams, 2000, 2
Comment MSDC-RI MSDC-RI MSDC-RI MSDC-RI MSDC-RI
Column type CapillaryCapillaryCapillaryCapillaryCapillary
Active phase DB-5BP-1DB-5BP-1BP-1
Column length (m) 30.25.30.25.25.
Carrier gas HeN2HeN2N2
Substrate
Column diameter (mm) 0.260.50.250.500.25
Phase thickness (μm) 0.25  0.25
Tstart (C) 60.60.60.60.60.
Tend (C) 246.220.180.220.220.
Heat rate (K/min) 3.5.2.5.5.
Initial hold (min)
Final hold (min)  10. 10.
I 1354.1337.1360.1337.1333.
ReferenceAdams, 2000, 3Rao, Kaul, et al., 2000Rao, Rout, et al., 2000Rao, Sastry, et al., 2000Kulkarni, Mallavarapu, et al., 1998
Comment MSDC-RI MSDC-RI MSDC-RI MSDC-RI MSDC-RI
Column type CapillaryCapillary
Active phase Methyl SiliconeSE-30
Column length (m) 25.25.
Carrier gas N2N2
Substrate
Column diameter (mm) 0.50.2
Phase thickness (μm)
Tstart (C) 60.60.
Tend (C) 220.180.
Heat rate (K/min) 5.3.
Initial hold (min)  10.
Final hold (min)  1.
I 1334.1332.
ReferenceMallavarapu, Rao, et al., 1998Jantan, Ahmad, et al., 1996
Comment MSDC-RI MSDC-RI

Normal alkane RI, polar column, custom temperature program

Data compiled by: NIST Mass Spectrometry Data Center, William E. Wallace, director

Column type CapillaryCapillaryCapillaryCapillaryCapillary
Active phase Carbowax 20MSupelco CO Wax-10Supelco CO Wax-10Innowax FSCCarbowax 20M
Column length (m)  60.60.60.
Carrier gas  HeliumHeliumHe
Substrate
Column diameter (mm)  0.320.320.25
Phase thickness (μm)  0.250.250.25
Program not specified35 0C (6 min) 2 0C/min -> 60 0C (5 min) 5 0C/min -> 200 0C 25 0C/min -> 250 0C (6 min)not specified60C(10min) => 4C/min => 220C(10min) => 1C/min => 240Cnot specified
I 1664.1660.1679.1668.1645.
ReferenceLee, Chong, et al., 2012Prompona, Kandylis, et al., 2012Prompona, Kandylis, et al., 2012Kosar, Özek, et al., 2005Vinogradov, 2004
Comment MSDC-RI MSDC-RI MSDC-RI MSDC-RI MSDC-RI
Column type CapillaryCapillaryCapillaryCapillaryCapillary
Active phase HP-Innowax FSCInnowaxHP-Innowax FSCCarbowax 20MCarbowax 20M
Column length (m) 60.60.60.60.
Carrier gas  HeHeHe
Substrate
Column diameter (mm) 0.250.250.250.25
Phase thickness (μm) 0.250.250.250.25
Program 60C(10min) => 4C/min => 220C(10min) => 1C/min => 240C60 0C (10 min) 4 K/min -> 220 0C (10 min) 1 K/min -> 240 0C60C(10min) => 4C/min => 220C(10min) => 1C/min => 240Cnot specifiednot specified
I 1668.1671.1668.1645.1645.
ReferenceTabanca, Kirimer, et al., 2001Baser, Tabanca, et al., 2000Bagci, Baser, et al., 1999Tirado, Stashenko, et al., 1995Shibamoto, 1987
Comment MSDC-RI MSDC-RI MSDC-RI MSDC-RI MSDC-RI

Kovats' RI, non-polar column, custom temperature program

Data compiled by: NIST Mass Spectrometry Data Center, William E. Wallace, director

Column type CapillaryCapillaryCapillaryCapillaryCapillary
Active phase Methyl SiliconeBP-1SPB-1BP-1BP-1
Column length (m)  25.30.25.30.
Carrier gas  N2 N2N2
Substrate
Column diameter (mm) 0.250.250.250.320.32
Phase thickness (μm)  0.250.250.250.25
Program not specified60C => 5C/min => 220C(5min) => 3C/min => 245C(5min)not specified60C => 5C/min => 220C(5min) => 3C/min => 245C(5min)60C => 5.5C/min => 220C => 3.5C/min => 245C
I 1352.1329.1335.1325.1331.
ReferenceStaples, 2005Dwivedi, Khan, et al., 2004Riu-Aumatell, Castellari, et al., 2004Raina, Srivastava, et al., 2003Rao, Kaul, et al., 2003
Comment MSDC-RI MSDC-RI MSDC-RI MSDC-RI MSDC-RI
Column type CapillaryCapillaryCapillary
Active phase HP-5DB-5DB-5
Column length (m) 30.30.30.
Carrier gas HeHe
Substrate
Column diameter (mm) 0.250.250.26
Phase thickness (μm) 0.25 0.25
Program not specifiednot specifiednot specified
I 1354.1355.1354.
ReferenceShellie and Marriott, 2003Rao, Rout, et al., 2000Adams, 1998
Comment MSDC-RI MSDC-RI MSDC-RI

Kovats' RI, non-polar column, isothermal

Data compiled by: NIST Mass Spectrometry Data Center, William E. Wallace, director

Column type CapillaryCapillary
Active phase SE-30SF-96
Column length (m) 40.152.
Carrier gas
Substrate
Column diameter (mm) 0.350.8
Phase thickness (μm) 0.35
Temperature (C) 100.135.
I 1335.01335.
ReferenceTudor, 1997Sakai, Maarse, et al., 1967
Comment MSDC-RI MSDC-RI

References

Stephenson and Malanowski, 1987
Stephenson, Richard M.; Malanowski, Stanislaw,
Handbook of the Thermodynamics of Organic Compounds, 1987, https://doi.org/10.1007/978-94-009-3173-2
. [all data]
Stull, 1947
Stull, Daniel R.,
Vapor Pressure of Pure Substances. Organic and Inorganic Compounds,
Ind. Eng. Chem., 1947, 39, 4, 517-540, https://doi.org/10.1021/ie50448a022
. [all data]