Disulfide, bis(phenylmethyl)
- Formula: C14H14S2
- Molecular weight: 246.391
- IUPAC Standard InChIKey: GVPWHKZIJBODOX-UHFFFAOYSA-N
- CAS Registry Number: 150-60-7
- Chemical structure:
View 3d structure (requires JavaScript / HTML 5) - Other names: Benzyl disulfide; α-(Benzyldithio)toluene; Benzyl bisulfide; BDS; Di(phenylmethyl)disulfide; Dibenzyl disulfide; 1,4-Diphenyl-2,3-dithiabutane; Dibenzyldisulfid; Disulfide, dibenzyl; Dibenzyl disulphide; Bis(phenylmethyl) disulfide; NSC 677465; NSC 6841

Phase change data

Data compiled as indicated in comments:
TRC - Thermodynamics Research Center, NIST Boulder Laboratories, Chris Muzny director
AC - William E. Acree, Jr., James S. Chickos
Quantity | Value | Units | Method | Reference | Comment |
---|---|---|---|---|---|
Tfus | 342. | K | N/A | Trotter and Thompson, 1946 | Uncertainty assigned by TRC = 2. K; TRC |
Enthalpy of fusion
ΔfusH (kJ/mol) | Temperature (K) | Reference | Comment |
---|---|---|---|
44.7 | 341.7 | Wang, Tan, et al., 2007 | AC |

Normal alkane RI, non-polar column, temperature ramp

Column type | Active phase | I | Reference | Comment |
---|---|---|---|---|
Capillary | DB-5MS | 2070. | Zoghbi, Andrade, et al., 2002 | 30. m/0.25 mm/0.25 μm, He, 3. K/min; Tstart: 60. C; Tend: 270. C |

References

Trotter and Thompson, 1946
Trotter, I.F.; Thompson, H.W.,
Infrared SPectra of Thiols, Sulfides, and Disulfides,
J. Chem. Soc., 1946, 1946, 481. [all data]
Wang, Tan, et al., 2007
Wang, Shao-Xu; Tan, Zhi-Cheng; Li, Yan-Sheng; Li, Ying; Shi, Quan; Tong, Bo,
Heat capacity and thermodynamic properties of benzyl disulfide (C14H14S2),
Thermochimica Acta, 2007, 463, 1-2, 21-25, https://doi.org/10.1016/j.tca.2007.05.014
. [all data]
Bonner, 1951
Bonner, W.A.,
The action of direct current on aqueous solutions of S-benzyl- and S-1-naphthylmethylthiuronium chlorides,
J. Am. Chem. Soc., 1951, 73, 464-465. [all data]
Zoghbi, Andrade, et al., 2002
Zoghbi, M.G.B.; Andrade, E.H.A.; Maia, J.G.S.,
Volatile constituents from Adenocalymma alliaceum Miers and Petiveria alliacea L., two medicinal herbs of the Amazon,
Flavour Fragr. J., 2002, 17, 2, 133-135, https://doi.org/10.1002/ffj.1051
. [all data]