m-Dioxane, 2,4-dimethyl-, trans-
- Formula: C6H12O2
- Molecular weight: 116.1583
- IUPAC Standard InChIKey: VREPYGYMOSZTKJ-PHDIDXHHSA-N
- CAS Registry Number: 15042-60-1
- Chemical structure:
View 3d structure (requires JavaScript / HTML 5) - Stereoisomers:
- Other names: trans-2,4-dimethyl-1,3-dioxane

Phase change data

Data compiled by: Thermodynamics Research Center, NIST Boulder Laboratories, Chris Muzny director
Quantity | Value | Units | Method | Reference | Comment |
---|---|---|---|---|---|
Tboil | 394.15 | K | N/A | Eliel and Knoeber, 1968 | Uncertainty assigned by TRC = 5. K |

References

Eliel and Knoeber, 1968
Eliel, E.L.; Knoeber, M.C.,
Conformational Analysis XVI. 1,3-Dioxanes,
J. Am. Chem. Soc., 1968, 90, 3444. [all data]