cis-2,4-Dimethyl-1,3-dioxane
- Formula: C6H12O2
- Molecular weight: 116.1583
- IUPAC Standard InChIKey: VREPYGYMOSZTKJ-NTSWFWBYSA-N
- CAS Registry Number: 15042-59-8
- Chemical structure:
View 3d structure (requires JavaScript / HTML 5) - Stereoisomers:

Gas phase thermochemistry data

Data compiled as indicated in comments:
DRB - Donald R. Burgess, Jr.
ALS - Hussein Y. Afeefy, Joel F. Liebman, and Stephen E. Stein
Quantity | Value | Units | Method | Reference | Comment |
---|---|---|---|---|---|
ΔfH°gas | -425.2 | kJ/mol | N/A | Pihlaja and Luoma, 1968 | Value computed using ΔfHliquid° value of -465.2±4.2 kj/mol from Pihlaja and Luoma, 1968 and ΔvapH° value of 40.0 kj/mol from Pihlaja and Heikkila, 1967.; DRB |
ΔfH°gas | -428. ± 3. | kJ/mol | Ccb | Pihlaja and Heikkila, 1967 | ALS |

Condensed phase thermochemistry data

Data compiled by: Hussein Y. Afeefy, Joel F. Liebman, and Stephen E. Stein
Quantity | Value | Units | Method | Reference | Comment |
---|---|---|---|---|---|
ΔfH°liquid | -465.2 ± 4.2 | kJ/mol | Ccb | Pihlaja and Luoma, 1968 | |
ΔfH°liquid | -468. ± 2. | kJ/mol | Ccb | Pihlaja and Heikkila, 1967 | |
Quantity | Value | Units | Method | Reference | Comment |
ΔcH°liquid | -3610.8 ± 4.2 | kJ/mol | Ccb | Pihlaja and Luoma, 1968 | Corresponding ΔfHºliquid = -465.22 kJ/mol (simple calculation by NIST; no Washburn corrections) |
ΔcH°liquid | -3608.3 ± 1.4 | kJ/mol | Ccb | Pihlaja and Heikkila, 1967 | Corresponding ΔfHºliquid = -467.73 kJ/mol (simple calculation by NIST; no Washburn corrections) |

Phase change data

Data compiled as indicated in comments:
TRC - Thermodynamics Research Center, NIST Boulder Laboratories, Chris Muzny director
ALS - Hussein Y. Afeefy, Joel F. Liebman, and Stephen E. Stein
DRB - Donald R. Burgess, Jr.
Quantity | Value | Units | Method | Reference | Comment |
---|---|---|---|---|---|
Tboil | 390.65 | K | N/A | Eliel and Knoeber, 1968 | Uncertainty assigned by TRC = 1.5 K; TRC |
Quantity | Value | Units | Method | Reference | Comment |
ΔvapH° | 40. ± 1. | kJ/mol | V | Pihlaja and Heikkila, 1967 | ALS |
ΔvapH° | 40.0 | kJ/mol | N/A | Pihlaja and Heikkila, 1967 | DRB |

References

Pihlaja and Luoma, 1968
Pihlaja, K.; Luoma, S.,
Heats of formation and conformational energies of 1,3-dioxane and its methyl homologues,
Acta Chem. Scand., 1968, 22, 2401-2414. [all data]
Pihlaja and Heikkila, 1967
Pihlaja, K.; Heikkila, J.,
The configurations of isomeric 2,2,4,6-tetramethyl-1,3-dioxanes,
Acta Chem. Scand., 1967, 21, 2430-2434. [all data]
Eliel and Knoeber, 1968
Eliel, E.L.; Knoeber, M.C.,
Conformational Analysis XVI. 1,3-Dioxanes,
J. Am. Chem. Soc., 1968, 90, 3444. [all data]